NetBSD Problem Report #37077

From  Sun Oct  7 23:50:48 2007
Return-Path: <>
Received: from ( [])
	by (Postfix) with ESMTP id CECCC63B8D8
	for <>; Sun,  7 Oct 2007 23:50:47 +0000 (UTC)
Message-Id: <>
Date: Sun,  7 Oct 2007 17:12:07 +0000 (UTC)
Subject: archivers/dar: undefined references on Slackware Lunix 10.2
X-Send-Pr-Version: www-1.0

>Number:         37077
>Category:       pkg
>Synopsis:       archivers/dar: undefined references on Slackware Linux 10.2
>Confidential:   no
>Severity:       critical
>Priority:       medium
>Responsible:    linux-pkg-people
>State:          closed
>Class:          sw-bug
>Submitter-Id:   net
>Arrival-Date:   Sun Oct 07 23:55:00 +0000 2007
>Closed-Date:    Sat Jul 19 12:53:32 +0000 2014
>Last-Modified:  Sat Jul 19 12:53:32 +0000 2014
>Originator:     De Zeurkous
>Release:        Slackware Lunix 10.2
Korax Productions
Linux zeurcomp 2.4.31 #21 Sun Jun 5 19:19:51 PDT 2005 i686 unknown unknown GNU/Lunix
When attempting to build archivers/dar on Slackware Lunix 10.2, I get the following errors:

shell_interaction.cpp:(.text+0x20e4): undefined reference to `__gnu_cxx::__exchange_and_add(int volatile*, int)'
shell_interaction.o:shell_interaction.cpp:(.text+0x2134): more undefined references to `__gnu_cxx::__exchange_and_add(int volatile*, int)' follow
../libdar/.libs/ undefined reference to `std::_Rb_tree_decrement(std::_Rb_tree_node_base*)'
../libdar/.libs/ undefined reference to `std::_List_node_base::transfer(std::_List_node_base*, std::_List_node_base*)'
../libdar/.libs/ undefined reference to `std::_Rb_tree_insert_and_rebalance(bool, std::_Rb_tree_node_base*, std::_Rb_tree_node_base*, std::_Rb_tree_node_base&)'
../libdar/.libs/ undefined reference to `std::_Rb_tree_rebalance_for_erase(std::_Rb_tree_node_base*, std::_Rb_tree_node_base&)'
../libdar/.libs/ undefined reference to `std::_Rb_tree_increment(std::_Rb_tree_node_base*)'
../libdar/.libs/ undefined reference to `std::basic_string<char, std::char_traits<char>, std::allocator<char> >::_Rep::_S_create(unsigned int, unsigned int, std::allocator<char> const&)'
../libdar/.libs/ undefined reference to `std::_List_node_base::swap(std::_List_node_base&, std::_List_node_base&)'
collect2: ld returned 1 exit status
gmake[3]: *** [dar] Error 1
gmake[3]: Leaving directory `/usr/pkgsrc/archivers/dar/work/dar-2.3.3/src/dar_suite'
gmake[2]: *** [all-recursive] Error 1
gmake[2]: Leaving directory `/usr/pkgsrc/archivers/dar/work/dar-2.3.3/src'
gmake[1]: *** [all-recursive] Error 1
gmake[1]: Leaving directory `/usr/pkgsrc/archivers/dar/work/dar-2.3.3'
gmake: *** [all] Error 2
*** Error code 2

bmake: stopped in /usr/pkgsrc/archivers/dar
*** Error code 1

bmake: stopped in /usr/pkgsrc/archivers/dar

Before the snip, a long list of very similar errors occours. 

This was using branch 2007Q2 updated from CVS a few minutes ago.

Complete make output available at (UNIX gzip, 13K)

make() ( exec bmake "${@}" );
cd archivers/dar &&
exec make
No fix is currently known.



Responsible-Changed-From-To: pkg-manager->linux-pkg-people
Responsible-Changed-When: Sun, 21 Feb 2010 15:46:17 +0000
Linux pkgsrc problem.

State-Changed-From-To: open->closed
State-Changed-When: Sat, 19 Jul 2014 12:53:32 +0000
I believe this problem was fixed in upstream
as I cannot reproduce it.


NetBSD Home
NetBSD PR Database Search

(Contact us) $NetBSD: query-full-pr,v 1.39 2013/11/01 18:47:49 spz Exp $
$NetBSD:,v 1.8 2006/05/07 09:23:38 tsutsui Exp $
Copyright © 1994-2007 The NetBSD Foundation, Inc. ALL RIGHTS RESERVED.