NetBSD Problem Report #37262

From  Fri Nov  2 11:01:45 2007
Return-Path: <>
Received: from ( [])
	by (Postfix) with ESMTP id EC0BB63BA35
	for <>; Fri,  2 Nov 2007 11:01:44 +0000 (UTC)
Message-Id: <>
Date: Fri,  2 Nov 2007 11:01:25 +0000 (UTC)
Subject: misc/koffice fails to build on SPARC Solaris with gcc-4.2.2
X-Send-Pr-Version: www-1.0

>Number:         37262
>Category:       pkg
>Synopsis:       misc/koffice fails to build on SPARC Solaris with gcc-4.2.2
>Confidential:   no
>Severity:       serious
>Priority:       medium
>Responsible:    solaris-pkg-people
>State:          closed
>Class:          sw-bug
>Submitter-Id:   net
>Arrival-Date:   Fri Nov 02 11:05:00 +0000 2007
>Closed-Date:    Thu Jun 25 05:42:22 +0000 2015
>Last-Modified:  Thu Jun 25 05:42:22 +0000 2015
>Originator:     raymond
SunOS ultra10 5.10 Generic_118833-33 sun4u sparc SUNW,Ultra-5_10
/bin/ksh ../../../../libtool --silent --tag=CC --mode=link gcc -DNO_TCL=1 -DNDEBUG -O2  -O -I/opt/pkg/include -I/opt/pkg/include/python2.4 -DLDAP_DEPRECATED -I/usr/include -I/opt/pkg/qt3/include -DGLX_GLXEXT_LEGACY -I/opt/pkg/include/freetype2 -I/opt/pkg/include/krb5 -I/opt/pkg/include/db4  -L/opt/pkg/qt3/lib -L/opt/pkg/lib -Wl,-R/opt/pkg/lib -L/opt/pkg/lib/python2.4/config -Wl,-R/opt/pkg/lib/python2.4/config -L/usr/lib -Wl,-R/usr/lib -Wl,-R/opt/pkg/qt3/lib -L/usr/openwin/lib -Wl,-R/usr/openwin/lib -o ksqlite  shell.o
Undefined                       first referenced
 symbol                             in file
fdatasync                           ./.libs/
ld: fatal: Symbol referencing errors. No output written to .libs/ksqlite
collect2: ld returned 1 exit status
gmake[5]: *** [ksqlite] Error 1
gmake[5]: Leaving directory `/opt/pkg.obj/misc/koffice/work.ultra10/koffice-1.6.3/kexi/3rdparty/kexisql3/src'
gmake[4]: *** [all-recursive] Error 1
gmake[4]: Leaving directory `/opt/pkg.obj/misc/koffice/work.ultra10/koffice-1.6.3/kexi/3rdparty/kexisql3'
gmake[3]: *** [all-recursive] Error 1
gmake[3]: Leaving directory `/opt/pkg.obj/misc/koffice/work.ultra10/koffice-1.6.3/kexi/3rdparty'
gmake[2]: *** [all-recursive] Error 1
gmake[2]: Leaving directory `/opt/pkg.obj/misc/koffice/work.ultra10/koffice-1.6.3/kexi'
gmake[1]: *** [all-recursive] Error 1
gmake[1]: Leaving directory `/opt/pkg.obj/misc/koffice/work.ultra10/koffice-1.6.3'
gmake: *** [all] Error 2
*** Error code 2

bmake: stopped in /opt/pkgsrc/misc/koffice
*** Error code 1


To fix undefined symbol fdatasync, it needs -lrt compiler flag



Responsible-Changed-From-To: pkg-manager->markd
Responsible-Changed-When: Tue, 06 Nov 2007 20:00:32 +0000
Assign to maintainer.
If you can't handle, this please assign to solaris-pkg-people.

Responsible-Changed-From-To: markd->solaris-pkg-people
Responsible-Changed-When: Sun, 12 Oct 2008 10:46:07 +0000
Solaris issue.

State-Changed-From-To: open->feedback
State-Changed-When: Thu, 18 Jun 2015 04:57:16 +0000
Does this still happen? I'm guessing probably not...

State-Changed-From-To: feedback->closed
State-Changed-When: Thu, 25 Jun 2015 05:42:22 +0000
Feedback mail bounced; and there's nothing much to be gained by keeping
ancient build failure PRs around. (The current Solaris builds are not
attempting to build koffice because of problems with poppler-qt; but
even so.)


NetBSD Home
NetBSD PR Database Search

(Contact us) $NetBSD: query-full-pr,v 1.39 2013/11/01 18:47:49 spz Exp $
$NetBSD:,v 1.8 2006/05/07 09:23:38 tsutsui Exp $
Copyright © 1994-2007 The NetBSD Foundation, Inc. ALL RIGHTS RESERVED.