NetBSD Problem Report #43726

From www@NetBSD.org  Mon Aug  9 02:50:19 2010
Return-Path: <www@NetBSD.org>
Received: from mail.netbsd.org (mail.netbsd.org [204.152.190.11])
	by www.NetBSD.org (Postfix) with ESMTP id 8242763BBBD
	for <gnats-bugs@gnats.NetBSD.org>; Mon,  9 Aug 2010 02:50:19 +0000 (UTC)
Message-Id: <20100809025018.B282163BBBA@www.NetBSD.org>
Date: Mon,  9 Aug 2010 02:50:18 +0000 (UTC)
From: rumi@rtfm.hu
Reply-To: rumi@rtfm.hu
To: gnats-bugs@NetBSD.org
Subject: Tru64: sysutils/dbus fails to compile because Tru64 is lacking vsyslog() implementation
X-Send-Pr-Version: www-1.0

>Number:         43726
>Category:       pkg
>Synopsis:       Tru64: sysutils/dbus fails to compile because Tru64 is lacking vsyslog() implementation
>Confidential:   no
>Severity:       non-critical
>Priority:       low
>Responsible:    osf1-pkg-people
>State:          open
>Class:          sw-bug
>Submitter-Id:   net
>Arrival-Date:   Mon Aug 09 02:55:00 +0000 2010
>Last-Modified:  Mon Feb 10 12:10:59 +0000 2014
>Originator:     Szabolcs Rumi
>Release:        Tru64 5.1B-5
>Organization:
>Environment:
# sizer -v
HP Tru64 UNIX V5.1B (Rev. 2650); Thu Dec 17 18:47:21 CET 2009
# cc -V
Compaq C V6.5-303 (dtk) on HP Tru64 UNIX V5.1B (Rev. 2650)
Compiler Driver V6.5-302 (dtk) cc Driver
# cxx -V
Compaq C++ V7.1-006 for HP Tru64 UNIX V5.1B (Rev. 2650)
Compiler Driver V7.1-006 (cxx) cxx Driver

pkgsrc-current-20100807

>Description:
libtool: link: cc -O2 -ieee -D_REENTRANT -pthread -I/usr/pkgsrc/sysutils/dbus/work/.buildlink/include -Wl,-rpath -Wl,/usr/pkg/lib -o dbus-daemon-launch-helper-test dbus_daemon_launch_helper_test-activation-helper-bin.o dbus_daemon_launch_helper_test-config-loader-expat.o dbus_daemon_launch_helper_test-config-parser-common.o dbus_daemon_launch_helper_test-config-parser-trivial.o dbus_daemon_launch_helper_test-desktop-file.o dbus_daemon_launch_helper_test-utils.o dbus_daemon_launch_helper_test-activation-helper.o  -L/usr/pkgsrc/sysutils/dbus/work/.buildlink/lib /usr/pkgsrc/sysutils/dbus/work/.buildlink/lib/libexpat.so ../dbus/.libs/libdbus-convenience.a -lpthread -lrt -pthread -rpath /usr/pkgsrc/sysutils/dbus/work/.buildlink/lib
ld:
Unresolved:
vsyslog
ld:
Unresolved:
vsyslog
gmake[2]: *** [dbus-daemon-launch-helper-test] Error 1
gmake[2]: *** Waiting for unfinished jobs....
gmake[2]: *** [dbus-daemon] Error 1
libtool: link: cc -O2 -ieee -D_REENTRANT -pthread -I/usr/pkgsrc/sysutils/dbus/work/.buildlink/include -Wl,-rpath -Wl,/usr/pkg/lib -o dbus-daemon-launch-helper activation-helper-bin.o config-loader-expat.o config-parser-common.o config-parser-trivial.o desktop-file.o utils.o activation-helper.o  -L/usr/pkgsrc/sysutils/dbus/work/.buildlink/lib /usr/pkgsrc/sysutils/dbus/work/.buildlink/lib/libexpat.so ../dbus/.libs/libdbus-convenience.a -lpthread -lrt -pthread -rpath /usr/pkgsrc/sysutils/dbus/work/.buildlink/lib
ld:
Unresolved:
vsyslog
gmake[2]: *** [dbus-daemon-launch-helper] Error 1
gmake[2]: Leaving directory `/usr/pkgsrc/sysutils/dbus/work/dbus-1.2.4.6permissive/bus'
gmake[1]: *** [all-recursive] Error 1
gmake[1]: Leaving directory `/usr/pkgsrc/sysutils/dbus/work/dbus-1.2.4.6permissive'
gmake: *** [all] Error 2
*** Error code 2

Stop.

>How-To-Repeat:

>Fix:

>Release-Note:

>Audit-Trail:

Responsible-Changed-From-To: pkg-manager->osf1-pkg-people
Responsible-Changed-By: obache@NetBSD.org
Responsible-Changed-When: Mon, 10 Feb 2014 12:10:59 +0000
Responsible-Changed-Why:
Problem on Tru64.


>Unformatted:

NetBSD Home
NetBSD PR Database Search

(Contact us) $NetBSD: query-full-pr,v 1.39 2013/11/01 18:47:49 spz Exp $
$NetBSD: gnats_config.sh,v 1.8 2006/05/07 09:23:38 tsutsui Exp $
Copyright © 1994-2007 The NetBSD Foundation, Inc. ALL RIGHTS RESERVED.