NetBSD Problem Report #46125

From yamt@NetBSD.org  Thu Mar  1 19:06:26 2012
Return-Path: <yamt@NetBSD.org>
Received: by www.NetBSD.org (Postfix, from userid 1270)
	id AA38B63DB26; Thu,  1 Mar 2012 19:06:26 +0000 (UTC)
Message-Id: <20120301190626.AA38B63DB26@www.NetBSD.org>
Date: Thu,  1 Mar 2012 19:06:26 +0000 (UTC)
From: yamt@NetBSD.org
Reply-To: yamt@NetBSD.org
To: gnats-bugs@NetBSD.org
Subject: lang/erlang doesn't build on OS X 10.6.8
X-Send-Pr-Version: 3.95

>Number:         46125
>Category:       pkg
>Synopsis:       lang/erlang doesn't build on OS X 10.6.8
>Confidential:   no
>Severity:       serious
>Priority:       medium
>Responsible:    pkg-manager
>State:          open
>Class:          sw-bug
>Submitter-Id:   net
>Arrival-Date:   Thu Mar 01 19:10:00 +0000 2012
>Originator:     YAMAMOTO Takashi
>Release:        pkgsrc current
>Organization:

>Environment:


System: Mac OS X 10.6.8
>Description:
	i got the following error.

=== Entering application runtime_tools
make  RELEASE_PATH=/Users/takashi/wrkobjdir/lang/erlang/work/.destdir/Users/takashi/pkg/lib/erlang   release_spec
/usr/bin/install -c -o takashi -g staff -d /Users/takashi/wrkobjdir/lang/erlang/work/.destdir/Users/takashi/pkg/lib/erlang/lib/runtime_tools-1.8.6/src
/usr/bin/install -c -o takashi -g staff -m 644 -p erts_alloc_config.erl inviso_rt.erl inviso_rt_meta.erl inviso_rt_lib.erl inviso_as_lib.erl inviso_autostart.erl inviso_autostart_server.erl runtime_tools.erl runtime_tools_sup.erl dbg.erl percept_profile.erl observer_backend.erl /Users/takashi/wrkobjdir/lang/erlang/work/.destdir/Users/takashi/pkg/lib/erlang/lib/runtime_tools-1.8.6/src
/usr/bin/install -c -o takashi -g staff -d /Users/takashi/wrkobjdir/lang/erlang/work/.destdir/Users/takashi/pkg/lib/erlang/lib/runtime_tools-1.8.6/include
/usr/bin/install -c -o takashi -g staff -m 644 -p ../include/observer_backend.hrl /Users/takashi/wrkobjdir/lang/erlang/work/.destdir/Users/takashi/pkg/lib/erlang/lib/runtime_tools-1.8.6/include
/usr/bin/install -c -o takashi -g staff -d /Users/takashi/wrkobjdir/lang/erlang/work/.destdir/Users/takashi/pkg/lib/erlang/lib/runtime_tools-1.8.6/ebin
/usr/bin/install -c -o takashi -g staff -m 644 -p ../ebin/erts_alloc_config.beam ../ebin/inviso_rt.beam ../ebin/inviso_rt_meta.beam ../ebin/inviso_rt_lib.beam ../ebin/inviso_as_lib.beam ../ebin/inviso_autostart.beam ../ebin/inviso_autostart_server.beam ../ebin/runtime_tools.beam ../ebin/runtime_tools_sup.beam ../ebin/dbg.beam ../ebin/percept_profile.beam ../ebin/observer_backend.beam ../ebin/runtime_tools.app ../ebin/runtime_tools.appup /Users/takashi/wrkobjdir/lang/erlang/work/.destdir/Users/takashi/pkg/lib/erlang/lib/runtime_tools-1.8.6/ebin
make -f i386-apple-darwin10.8.0/Makefile release
make  RELEASE_PATH=/Users/takashi/wrkobjdir/lang/erlang/work/.destdir/Users/takashi/pkg/lib/erlang   release_spec
make -f i386-apple-darwin10.8.0/Makefile release_spec
/usr/bin/install -c -o takashi -g staff -d /Users/takashi/wrkobjdir/lang/erlang/work/.destdir/Users/takashi/pkg/lib/erlang/lib/runtime_tools-1.8.6/priv/lib
/usr/bin/install -c -s -o takashi -g staff -m 755 ../priv/lib/i386-apple-darwin10.8.0/trace_ip_drv.so ../priv/lib/i386-apple-darwin10.8.0/trace_file_drv.so /Users/takashi/wrkobjdir/lang/erlang/work/.destdir/Users/takashi/pkg/lib/erlang/lib/runtime_tools-1.8.6/priv/lib
strip: symbols referenced by indirect symbol table entries that can't be stripped in: /Users/takashi/wrkobjdir/lang/erlang/work/.destdir/Users/takashi/pkg/lib/erlang/lib/runtime_tools-1.8.6/priv/lib/trace_ip_drv.so
___error
___stack_chk_fail
_accept$UNIX2003
_bind$UNIX2003
_close$UNIX2003
_driver_alloc
_driver_alloc_binary
_driver_free
_driver_select
_exit
_fcntl$UNIX2003
_fprintf
_fwrite$UNIX2003
_getsockname$UNIX2003
_listen$UNIX2003
_memcpy
_memset
_read$UNIX2003
_send$UNIX2003
_set_port_control_flags
_setsockopt
_socket
_sscanf
make[6]: *** [release_spec] Error 70
make[5]: *** [release_spec] Error 2
make[4]: *** [release] Error 2
make[3]: *** [release] Error 2
make[2]: *** [release] Error 2
make[1]: *** [release] Error 2
gnumake: *** [install.libs] Error 2
*** Error code 2

Stop.
bmake: stopped in /Users/takashi/pkgsrc/lang/erlang
*** Error code 1

Stop.
bmake: stopped in /Users/takashi/pkgsrc/lang/erlang

>How-To-Repeat:

>Fix:


>Unformatted:

NetBSD Home
NetBSD PR Database Search

(Contact us) $NetBSD: query-full-pr,v 1.39 2013/11/01 18:47:49 spz Exp $
$NetBSD: gnats_config.sh,v 1.8 2006/05/07 09:23:38 tsutsui Exp $
Copyright © 1994-2007 The NetBSD Foundation, Inc. ALL RIGHTS RESERVED.