NetBSD Problem Report #46336

From bch@methodlogic.net  Sun Apr 15 21:22:28 2012
Return-Path: <bch@methodlogic.net>
Received: from mail.netbsd.org (mail.netbsd.org [149.20.53.66])
	by www.NetBSD.org (Postfix) with ESMTP id 39FED63BBEC
	for <gnats-bugs@gnats.NetBSD.org>; Sun, 15 Apr 2012 21:22:28 +0000 (UTC)
Message-Id: <20120415212153.GA7522@methodlogic.net>
Date: Sun, 15 Apr 2012 21:21:53 +0000
From: bch@methodlogic.net
To: gnats-bugs@gnats.NetBSD.org
Subject: pkgsrc firefox 11 fails to build
X-Send-Pr-Version: 3.95

>Number:         46336
>Category:       pkg
>Synopsis:       firefox 11 fails to build in -current
>Confidential:   no
>Severity:       serious
>Priority:       medium
>Responsible:    pkg-manager
>State:          closed
>Class:          sw-bug
>Submitter-Id:   net
>Arrival-Date:   Sun Apr 15 21:25:00 +0000 2012
>Closed-Date:    Fri Feb 01 22:54:47 +0000 2013
>Last-Modified:  Fri Feb 01 22:54:47 +0000 2013
>Originator:     =09
>Release:        NetBSD 6.99.4
>Organization:
	Method Logic Digital (http://www.methodlogic.net/)
>Environment:
System: NetBSD kamloops 6.99.4 NetBSD 6.99.4 (kamloops) #282: Sat Mar 31 15=
:45:52 PDT 2012 root@kamloops:/usr/obj/sys/arch/amd64/compile/kamloops amd64
Architecture: x86_64
Machine: amd64
>Description:
  Firefox fails to build.

  Tail-end of build failure:
=09
	c++ -o nsProtectedAuthThread.o -c -I../../../../dist/stl_wrappers -I../../=
=2E./../dist/system_wrappers -include ../../../../config/gcc_hidden.h -DNSS=
_ENABLE_ECC -DDLL_PREFIX=3D\"lib\" -DDLL_SUFFIX=3D\".so\"  -DXPCOM_TRANSLAT=
E_NSGM_ENTRY_POINT=3D1 -DMOZILLA_INTERNAL_API -D_IMPL_NS_COM -DEXPORT_XPT_A=
PI -DEXPORT_XPTC_API -D_IMPL_NS_GFX -D_IMPL_NS_WIDGET -DIMPL_XREAPI -DIMPL_=
NS_NET -DIMPL_THEBES  -DSTATIC_EXPORTABLE_JS_API -DOSTYPE=3D\"NetBSD6.99\" =
-DOSARCH=3DNetBSD -I/usr/pkg/include/nss/nss -I/usr/pkg/include/nss -I/usr/=
pkg/include/nspr   -I. -I. -I../../../../dist/include -I../../../../dist/in=
clude/nsprpub  -I/usr/pkg/include/nspr -I/usr/pkg/include/nss/nss -I/usr/pk=
g/include/nss -I/usr/pkg/include/nspr        -fPIC -DPIC -I/usr/pkg/include=
 -I/usr/include -I/usr/pkg/include/nspr -I/usr/X11R7/include -I/usr/X11R7/i=
nclude/freetype2 -fno-rtti -Wall -Wpointer-arith -Woverloaded-virtual -Wsyn=
th -Wno-ctor-dtor-privacy -Wno-non-virtual-dtor -Wcast-align -Wno-invalid-o=
ffsetof -Wno-variadic-macros -Werror=3Dreturn-type -O2 -I/usr/pkg/include -=
I/usr/include -I/usr/pkg/include/nspr -I/usr/X11R7/include -I/usr/X11R7/inc=
lude/freetype2 -fno-exceptions -fno-strict-aliasing -Dunix -std=3Dgnu++0x -=
pthread -ffunction-sections -fdata-sections -pipe  -DDEBUG -D_DEBUG -DTRACI=
NG -g -O2 -fno-omit-frame-pointer  -I/usr/pkg/include -I/usr/include -I/usr=
/pkg/include/nspr -I/usr/X11R7/include -I/usr/X11R7/include/freetype2 -DMOZ=
ILLA_CLIENT -include ../../../../mozilla-config.h -MD -MF .deps/nsProtected=
AuthThread.pp /usr/pkgsrc/devel/xulrunner/work/mozilla-release/security/man=
ager/ssl/src/nsProtectedAuthThread.cpp
	nsNSSCallbacks.cpp
	c++ -o nsNSSCallbacks.o -c -I../../../../dist/stl_wrappers -I../../../../d=
ist/system_wrappers -include ../../../../config/gcc_hidden.h -DNSS_ENABLE_E=
CC -DDLL_PREFIX=3D\"lib\" -DDLL_SUFFIX=3D\".so\"  -DXPCOM_TRANSLATE_NSGM_EN=
TRY_POINT=3D1 -DMOZILLA_INTERNAL_API -D_IMPL_NS_COM -DEXPORT_XPT_API -DEXPO=
RT_XPTC_API -D_IMPL_NS_GFX -D_IMPL_NS_WIDGET -DIMPL_XREAPI -DIMPL_NS_NET -D=
IMPL_THEBES  -DSTATIC_EXPORTABLE_JS_API -DOSTYPE=3D\"NetBSD6.99\" -DOSARCH=
=3DNetBSD -I/usr/pkg/include/nss/nss -I/usr/pkg/include/nss -I/usr/pkg/incl=
ude/nspr   -I. -I. -I../../../../dist/include -I../../../../dist/include/ns=
prpub  -I/usr/pkg/include/nspr -I/usr/pkg/include/nss/nss -I/usr/pkg/includ=
e/nss -I/usr/pkg/include/nspr        -fPIC -DPIC -I/usr/pkg/include -I/usr/=
include -I/usr/pkg/include/nspr -I/usr/X11R7/include -I/usr/X11R7/include/f=
reetype2 -fno-rtti -Wall -Wpointer-arith -Woverloaded-virtual -Wsynth -Wno-=
ctor-dtor-privacy -Wno-non-virtual-dtor -Wcast-align -Wno-invalid-offsetof =
-Wno-variadic-macros -Werror=3Dreturn-type -O2 -I/usr/pkg/include -I/usr/in=
clude -I/usr/pkg/include/nspr -I/usr/X11R7/include -I/usr/X11R7/include/fre=
etype2 -fno-exceptions -fno-strict-aliasing -Dunix -std=3Dgnu++0x -pthread =
-ffunction-sections -fdata-sections -pipe  -DDEBUG -D_DEBUG -DTRACING -g -O=
2 -fno-omit-frame-pointer  -I/usr/pkg/include -I/usr/include -I/usr/pkg/inc=
lude/nspr -I/usr/X11R7/include -I/usr/X11R7/include/freetype2 -DMOZILLA_CLI=
ENT -include ../../../../mozilla-config.h -MD -MF .deps/nsNSSCallbacks.pp /=
usr/pkgsrc/devel/xulrunner/work/mozilla-release/security/manager/ssl/src/ns=
NSSCallbacks.cpp
	/usr/pkgsrc/devel/xulrunner/work/mozilla-release/security/manager/ssl/src/=
nsNSSCallbacks.cpp: In function 'void HandshakeCallback(PRFileDesc*, void*)=
':
	/usr/pkgsrc/devel/xulrunner/work/mozilla-release/security/manager/ssl/src/=
nsNSSCallbacks.cpp:962:5: error: 'SSLNextProtoState' was not declared in th=
is scope
	/usr/pkgsrc/devel/xulrunner/work/mozilla-release/security/manager/ssl/src/=
nsNSSCallbacks.cpp:962:23: error: expected ';' before 'state'
	/usr/pkgsrc/devel/xulrunner/work/mozilla-release/security/manager/ssl/src/=
nsNSSCallbacks.cpp:966:31: error: 'state' was not declared in this scope
	/usr/pkgsrc/devel/xulrunner/work/mozilla-release/security/manager/ssl/src/=
nsNSSCallbacks.cpp:966:58: error: 'SSL_GetNextProto' was not declared in th=
is scope
	/usr/pkgsrc/devel/xulrunner/work/mozilla-release/security/manager/ssl/src/=
nsNSSCallbacks.cpp:967:18: error: 'SSL_NEXT_PROTO_NEGOTIATED' was not decla=
red in this scope
	gmake[5]: *** [nsNSSCallbacks.o] Error 1
	gmake[5]: Leaving directory `/usr/pkgsrc/devel/xulrunner/work/mozilla-rele=
ase/security/manager/ssl/src'
	gmake[4]: *** [libs] Error 2
	gmake[4]: Leaving directory `/usr/pkgsrc/devel/xulrunner/work/mozilla-rele=
ase/security/manager/ssl'
	gmake[3]: *** [libs] Error 2
	gmake[3]: Leaving directory `/usr/pkgsrc/devel/xulrunner/work/mozilla-rele=
ase/security/manager'
	gmake[2]: *** [libs_tier_platform] Error 2
	gmake[2]: Leaving directory `/usr/pkgsrc/devel/xulrunner/work/mozilla-rele=
ase'
	gmake[1]: *** [tier_platform] Error 2
	gmake[1]: Leaving directory `/usr/pkgsrc/devel/xulrunner/work/mozilla-rele=
ase'
	gmake: *** [all] Error 2
	*** Error code 2

	Stop.
	make: stopped in /usr/pkgsrc/devel/xulrunner
	*** Error code 1

	Stop.
	make: stopped in /usr/pkgsrc/devel/xulrunner
	*** Error code 1

	Stop.
	make: stopped in /usr/pkgsrc/www/firefox

>How-To-Repeat:
	cd /usr/pkgsrc/www/firefox; make
>Fix:
=09

>Release-Note:

>Audit-Trail:

Responsible-Changed-From-To: pkg-manager->tnn
Responsible-Changed-By: hauke@NetBSD.org
Responsible-Changed-When: Mon, 16 Apr 2012 07:24:36 +0000
Responsible-Changed-Why:
Over to maintainer.


From: Ryo ONODERA <ryo_on@yk.rim.or.jp>
To: gnats-bugs@NetBSD.org
Cc: 
Subject: Re: pkg/46336: pkgsrc firefox 11 fails to build
Date: Tue, 17 Apr 2012 01:11:43 +0900 (JST)

 I cannot reproduce this error on NetBSD/i386 6.99.4 of today.

 Older xulrunner (for example xulrunner 8.0) installed?
 If so, please delete it before starting build.
 http://mail-index.netbsd.org/pkgsrc-users/2012/03/26/msg015955.html


Responsible-Changed-From-To: tnn->pkg-manager
Responsible-Changed-By: wiz@NetBSD.org
Responsible-Changed-When: Fri, 01 Feb 2013 22:54:47 +0000
Responsible-Changed-Why:
Back to role account.


State-Changed-From-To: open->closed
State-Changed-By: wiz@NetBSD.org
State-Changed-When: Fri, 01 Feb 2013 22:54:47 +0000
State-Changed-Why:
Basically in feedback since April 2012 but no reply.


>Unformatted:

NetBSD Home
NetBSD PR Database Search

(Contact us) $NetBSD: query-full-pr,v 1.39 2013/11/01 18:47:49 spz Exp $
$NetBSD: gnats_config.sh,v 1.8 2006/05/07 09:23:38 tsutsui Exp $
Copyright © 1994-2007 The NetBSD Foundation, Inc. ALL RIGHTS RESERVED.