NetBSD Problem Report #47259

From helgoman@nbsd_t43p.fritz.box  Wed Nov 28 07:08:59 2012
Return-Path: <helgoman@nbsd_t43p.fritz.box>
Received: from mail.netbsd.org (mail.netbsd.org [149.20.53.66])
	by www.NetBSD.org (Postfix) with ESMTP id F3F8C63DFC7
	for <gnats-bugs@gnats.NetBSD.org>; Wed, 28 Nov 2012 07:08:58 +0000 (UTC)
Message-Id: <20121128055036.2E17A22433F@nbsd_t43p.fritz.box>
Date: Wed, 28 Nov 2012 06:50:36 +0100 (CET)
From: h_muehlmeier@gmx.de
Reply-To: h_muehlmeier@gmx.de
To: gnats-bugs@gnats.NetBSD.org
Subject: current devel/gnustep-base does not buils
X-Send-Pr-Version: 3.95

>Number:         47259
>Category:       pkg
>Synopsis:       current devel/gnustep-base does not build
>Confidential:   no
>Severity:       serious
>Priority:       medium
>Responsible:    pkg-manager
>State:          open
>Class:          sw-bug
>Submitter-Id:   net
>Arrival-Date:   Wed Nov 28 07:10:01 +0000 2012
>Last-Modified:  Mon Dec 23 11:40:38 +0000 2013
>Originator:     Helge Muehlmeier
>Release:        NetBSD 6.0
>Organization:

>Environment:


System: NetBSD nbsd_t43p.fritz.box 6.0 NetBSD 6.0 (GENERIC) i386
Architecture: i386
Machine: i386
>Description:
	devel/gnustep-base does not build and end up like this:
checking for i486--netbsdelf-gcc... gcc
checking for C compiler default output file name... 
configure: error: in `/usr/pkgsrc_current/devel/gnustep-base/work/gnustep-base-1.24.0':
configure: error: C compiler cannot create executables
See `config.log' for more details.
*** Error code 77

Stop.
make: stopped in /usr/pkgsrc_current/devel/gnustep-base
*** Error code 1
>How-To-Repeat:
	update pkgsrc-current and build devel/gnustep-base
(or meta-pkgs/gnustep)
>Fix:


>Release-Note:

>Audit-Trail:
From: Bernd Ernesti <netbsd@lists.veego.de>
To: gnats-bugs@NetBSD.org
Cc: 
Subject: Re: pkg/47259: current devel/gnustep-base does not buils
Date: Wed, 28 Nov 2012 08:24:53 +0100

 On Wed, Nov 28, 2012 at 07:10:01AM +0000, h_muehlmeier@gmx.de wrote:
 [..]

 > configure: error: in `/usr/pkgsrc_current/devel/gnustep-base/work/gnustep-base-1.24.0':
 > configure: error: C compiler cannot create executables
 > See `config.log' for more details.
 > *** Error code 77

 Without the end of this log file it is impossible to say what went wrong.

Responsible-Changed-From-To: pkg-manager->rh
Responsible-Changed-By: wiz@NetBSD.org
Responsible-Changed-When: Wed, 28 Nov 2012 09:55:55 +0000
Responsible-Changed-Why:
Over to maintainer.


From: =?ISO-8859-1?Q?Helge_M=FChlmeier?= <H_Muehlmeier@gmx.de>
To: gnats-bugs@NetBSD.org
Cc: Bernd Ernesti <netbsd@lists.veego.de>, pkg-manager@netbsd.org, 
 gnats-admin@netbsd.org, pkgsrc-bugs@netbsd.org
Subject: Re: pkg/47259: current devel/gnustep-base does not buils
Date: Wed, 28 Nov 2012 18:18:47 +0100

 This is a multi-part message in MIME format.
 --------------020104090003060304010805
 Content-Type: text/plain; charset=ISO-8859-1; format=flowed
 Content-Transfer-Encoding: 7bit

 On 11/28/12 08:30, Bernd Ernesti wrote:
 > The following reply was made to PR pkg/47259; it has been noted by GNATS.
 >
 > From: Bernd Ernesti <netbsd@lists.veego.de>
 > To: gnats-bugs@NetBSD.org
 > Cc:
 > Subject: Re: pkg/47259: current devel/gnustep-base does not buils
 > Date: Wed, 28 Nov 2012 08:24:53 +0100
 >
 >   On Wed, Nov 28, 2012 at 07:10:01AM +0000, h_muehlmeier@gmx.de wrote:
 >   [..]
 >   
 >   > configure: error: in `/usr/pkgsrc_current/devel/gnustep-base/work/gnustep-base-1.24.0':
 >   > configure: error: C compiler cannot create executables
 >   > See `config.log' for more details.
 >   > *** Error code 77
 >   
 >   Without the end of this log file it is impossible to say what went wrong.
 >   
 Here the end from terminal (I think really more interesting information 
 isn't there...)

 --------------------
 checking for C compiler default output file name...
 configure: error: in 
 `/usr/pkgsrc_current/devel/gnustep-base/work/gnustep-base-1.24.0':
 configure: error: C compiler cannot create executables
 See `config.log' for more details.
 *** Error code 77

 Stop.
 make: stopped in /usr/pkgsrc_current/devel/gnustep-base
 *** Error code 1

 Stop.
 make: stopped in /usr/pkgsrc_current/devel/gnustep-base
 *** Error code 1

 Stop.
 make: stopped in /usr/pkgsrc_current/meta-pkgs/gnustep
 nbsd_t43p$ pwd
 /usr/pkgsrc_current/meta-pkgs/gnustep
 nbsd_t43p$
 ---------------------

 I attached the config.log- file from devel/gnustep-base...
 There is this reported:
 --------------------------
 Thread model: posix
 configure:3671: $? = 0
 configure:3678: gcc -V >&5
 clang: error: unsupported option '-V -Qunused-arguments'
 clang: error: no input files
 configure:3682: $? = 1
 configure:3705: checking for C compiler default output file name
 configure:3727: gcc -O2 -I/usr/pkg/include 
 -I/usr/pkg/share/GNUstep/include -I/usr/include -I/usr/pkg/include 
 -I/usr/pkg/share/GNUstep/include -I/usr/include -I/usr/pkg/include 
 -I/usr/pkg/include -I/usr/pkg/include -L/usr/pkg/lib 
 -L/usr/pkg/share/GNUstep/lib -Wl,-rpath,/usr/pkg/lib 
 -Wl,-rpath,/usr/pkg/share/GNUstep/lib -L/usr/lib -Wl,-rpath,/usr/lib 
 -lobjc -lpthread -L/usr/pkg/lib -L/usr/pkg/lib -L/usr/pkg/lib 
 conftest.c  >&5
 /usr/pkgsrc_current/devel/gnustep-base/work/.buildlink/lib/libobjc.so: 
 undefined reference to `__i686.get_pc_thunk.bx'
 clang: error: linker command failed with exit code 1 (use -v to see 
 invocation)
 configure:3731: $? = 1
 configure:3769: result:
 configure: failed program was:
 | /* confdefs.h.  */
 | #define PACKAGE_NAME ""
 | #define PACKAGE_TARNAME ""
 --------------------------

 Greetings,
 Helge


 --------------020104090003060304010805
 Content-Type: text/plain; charset=UTF-8;
  name="config.log"
 Content-Transfer-Encoding: 7bit
 Content-Disposition: attachment;
  filename="config.log"

 This file contains any messages produced by compilers while
 running configure, to aid debugging if configure makes a mistake.

 It was created by configure, which was
 generated by GNU Autoconf 2.63.  Invocation command line was

   $ ./configure --exec-prefix=/usr/pkg/libexec/GNUstep --with-library-flags=-L/usr/pkg/lib -L/usr/pkg/share/GNUstep/lib -Wl,-rpath,/usr/pkg/lib -Wl,-rpath,/usr/pkg/share/GNUstep/lib --prefix=/usr/pkg --build=i486--netbsdelf --host=i486--netbsdelf --mandir=/usr/pkg/man

 ## --------- ##
 ## Platform. ##
 ## --------- ##

 hostname = nbsd_t43p.fritz.box
 uname -m = i386
 uname -r = 6.0
 uname -s = NetBSD
 uname -v = NetBSD 6.0 (GENERIC)

 /usr/bin/uname -p = i386
 /bin/uname -X     = unknown

 /bin/arch              = unknown
 /usr/bin/arch -k       = unknown
 /usr/convex/getsysinfo = unknown
 /usr/bin/hostinfo      = unknown
 /bin/machine           = unknown
 /usr/bin/oslevel       = unknown
 /bin/universe          = unknown

 PATH: /usr/pkgsrc_current/devel/gnustep-base/work/.wrapper/bin
 PATH: /usr/pkgsrc_current/devel/gnustep-base/work/.buildlink/bin
 PATH: /usr/pkgsrc_current/devel/gnustep-base/work/.tools/bin
 PATH: /usr/pkg/bin
 PATH: /usr/pkgsrc_current/meta-pkgs/gnustep/work/.buildlink/share/GNUstep/Tools
 PATH: /usr/pkgsrc_current/meta-pkgs/gnustep/work/.buildlink/share/GNUstep/Tools/i486/netbsd
 PATH: /home/helgoman/bin
 PATH: /bin
 PATH: /sbin
 PATH: /usr/bin
 PATH: /usr/sbin
 PATH: /usr/X11R7/bin
 PATH: /usr/X11R6/bin
 PATH: /usr/pkg/bin
 PATH: /usr/pkg/sbin
 PATH: /usr/games
 PATH: /usr/local/bin
 PATH: /usr/local/sbin
 PATH: /usr/pkg/bin
 PATH: /usr/X11R7/bin


 ## ----------- ##
 ## Core tests. ##
 ## ----------- ##

 configure:2131: checking build system type
 configure:2149: result: i486--netbsdelf
 configure:2171: checking host system type
 configure:2186: result: i486--netbsdelf
 configure:2208: checking target system type
 configure:2223: result: i486--netbsdelf
 configure:2255: checking for GNUstep configuration file to use at runtime
 configure:2294: result: /usr/pkg/etc/GNUstep.conf
 configure:2309: checking whether the GNUstep.conf file path can be set in the environment
 configure:2324: result: yes
 configure:2366: checking if we should import an existing configuration file now
 configure:2379: result: yes
 configure:2386: checking for default GNUstep configuration file to use
 configure:2414: result: /usr/pkg/etc/GNUstep.conf
 configure:2446: result: trying to import "/usr/pkg/etc/GNUstep.conf"
 configure:2450: If this fails, please run configure again with the --disable-importing-config-file option or specifying an alternative file using the --with-default-config= option
 configure:2528: checking for GNUstep-base installation domain
 --installation-domain-for=xxx: prints the value of the default installation domain
                 personalized using an installation-domains.conf file.
 configure:2568: result: LOCAL
 configure:2677: checking if we are hardcoding any relative paths in gnustep-base
 configure:2679: result: no
 configure:2688: We store the following filesystem layout into gnustep-base, to be used when no config file is found
 configure:2690: checking for Makefiles directory
 configure:2692: result: /usr/pkg/share/GNUstep/Makefiles
 configure:2694: checking for user defaults directory
 configure:2696: result: GNUstep/Defaults
 configure:2698: checking for user config file
 configure:2700: result: .GNUstep.conf
 configure:2703: checking for System Applications directory
 configure:2705: result: /usr/pkg/lib/GNUstep/Applications
 configure:2707: checking for System Admin Applications directory
 configure:2709: result: /usr/pkg/lib/GNUstep/Applications
 configure:2711: checking for System Web Applications directory
 configure:2713: result: /usr/pkg/lib/GNUstep/WebApplications
 configure:2715: checking for System Tools directory
 configure:2717: result: /usr/pkg/bin
 configure:2719: checking for System Admin Tools directory
 configure:2721: result: /usr/pkg/sbin
 configure:2723: checking for System Library directory
 configure:2725: result: /usr/pkg/lib/GNUstep
 configure:2727: checking for System Libraries directory
 configure:2729: result: /usr/pkg/lib
 configure:2731: checking for System Headers directory
 configure:2733: result: /usr/pkg/include
 configure:2735: checking for System Documentation directory
 configure:2737: result: /usr/pkg/share/GNUstep/Documentation
 configure:2739: checking for System Info Documentation directory
 configure:2741: result: /usr/pkg/info
 configure:2743: checking for System Man Documentation directory
 configure:2745: result: /usr/pkg/man
 configure:2748: checking for Network Applications directory
 configure:2750: result: /usr/pkg/lib/GNUstep/Applications
 configure:2752: checking for Network Admin Applications directory
 configure:2754: result: /usr/pkg/lib/GNUstep/Applications
 configure:2756: checking for Network Web Applications directory
 configure:2758: result: /usr/pkg/lib/GNUstep/WebApplications
 configure:2760: checking for Network Tools directory
 configure:2762: result: /usr/pkg/bin
 configure:2764: checking for Network Admin Tools directory
 configure:2766: result: /usr/pkg/sbin
 configure:2768: checking for Network Library directory
 configure:2770: result: /usr/pkg/lib/GNUstep
 configure:2772: checking for Network Libraries directory
 configure:2774: result: /usr/pkg/lib
 configure:2776: checking for Network Headers directory
 configure:2778: result: /usr/pkg/include
 configure:2780: checking for Network Documentation directory
 configure:2782: result: /usr/pkg/share/GNUstep/Documentation
 configure:2784: checking for Network Info Documentation directory
 configure:2786: result: /usr/pkg/info
 configure:2788: checking for Network Man Documentation directory
 configure:2790: result: /usr/pkg/man
 configure:2793: checking for Local Applications directory
 configure:2795: result: /usr/pkg/lib/GNUstep/Applications
 configure:2797: checking for Local Admin Applications directory
 configure:2799: result: /usr/pkg/lib/GNUstep/Applications
 configure:2801: checking for Local Web Applications directory
 configure:2803: result: /usr/pkg/lib/GNUstep/WebApplications
 configure:2805: checking for Local Tools directory
 configure:2807: result: /usr/pkg/bin
 configure:2809: checking for Local Admin Tools directory
 configure:2811: result: /usr/pkg/sbin
 configure:2813: checking for Local Library directory
 configure:2815: result: /usr/pkg/lib/GNUstep
 configure:2817: checking for Local Libraries directory
 configure:2819: result: /usr/pkg/lib
 configure:2821: checking for Local Headers directory
 configure:2823: result: /usr/pkg/include
 configure:2825: checking for Local Documentation directory
 configure:2827: result: /usr/pkg/share/GNUstep/Documentation
 configure:2829: checking for Local Info Documentation directory
 configure:2831: result: /usr/pkg/info
 configure:2833: checking for Local Man Documentation directory
 configure:2835: result: /usr/pkg/man
 configure:2838: checking for User Applications directory
 configure:2840: result: GNUstep/Applications
 configure:2842: checking for User Admin Applications directory
 configure:2844: result: GNUstep/Applications/Admin
 configure:2846: checking for User Web Applications directory
 configure:2848: result: GNUstep/WebApplications
 configure:2850: checking for User Tools directory
 configure:2852: result: GNUstep/Tools
 configure:2854: checking for User Admin Tools directory
 configure:2856: result: GNUstep/Tools/Admin
 configure:2858: checking for User Library directory
 configure:2860: result: GNUstep/Library
 configure:2862: checking for User Libraries directory
 configure:2864: result: GNUstep/Library/Libraries
 configure:2866: checking for User Headers directory
 configure:2868: result: GNUstep/Library/Headers
 configure:2870: checking for User Documentation directory
 configure:2872: result: GNUstep/Library/Documentation
 configure:2874: checking for User Info Documentation directory
 configure:2876: result: GNUstep/Library/Documentation/info
 configure:2878: checking for User Man Documentation directory
 configure:2880: result: GNUstep/Library/Documentation/man
 configure:2883: checking for System User directory
 configure:2885: result: /home
 configure:2887: checking for Network User directory
 configure:2889: result: /home
 configure:2891: checking for Local User directory
 configure:2893: result: /home
 configure:3349: checking for i486--netbsdelf-gcc
 configure:3376: result: gcc
 configure:3648: checking for C compiler version
 configure:3656: gcc --version >&5
 clang version 3.1 (branches/release_31)
 Target: i386--netbsdelf
 Thread model: posix
 configure:3660: $? = 0
 configure:3667: gcc -v >&5
 clang version 3.1 (branches/release_31)
 Target: i386--netbsdelf
 Thread model: posix
 configure:3671: $? = 0
 configure:3678: gcc -V >&5
 clang: error: unsupported option '-V -Qunused-arguments'
 clang: error: no input files
 configure:3682: $? = 1
 configure:3705: checking for C compiler default output file name
 configure:3727: gcc -O2 -I/usr/pkg/include -I/usr/pkg/share/GNUstep/include -I/usr/include -I/usr/pkg/include -I/usr/pkg/share/GNUstep/include -I/usr/include -I/usr/pkg/include -I/usr/pkg/include -I/usr/pkg/include -L/usr/pkg/lib -L/usr/pkg/share/GNUstep/lib -Wl,-rpath,/usr/pkg/lib -Wl,-rpath,/usr/pkg/share/GNUstep/lib -L/usr/lib -Wl,-rpath,/usr/lib -lobjc -lpthread -L/usr/pkg/lib -L/usr/pkg/lib -L/usr/pkg/lib conftest.c  >&5
 /usr/pkgsrc_current/devel/gnustep-base/work/.buildlink/lib/libobjc.so: undefined reference to `__i686.get_pc_thunk.bx'
 clang: error: linker command failed with exit code 1 (use -v to see invocation)
 configure:3731: $? = 1
 configure:3769: result: 
 configure: failed program was:
 | /* confdefs.h.  */
 | #define PACKAGE_NAME ""
 | #define PACKAGE_TARNAME ""
 | #define PACKAGE_VERSION ""
 | #define PACKAGE_STRING ""
 | #define PACKAGE_BUGREPORT ""
 | #define OPTION_NO_ENVIRONMENT 0
 | #define GNUSTEP_TARGET_MAKEFILES "/usr/pkg/share/GNUstep/Makefiles"
 | #define GNUSTEP_TARGET_USER_DEFAULTS_DIR "GNUstep/Defaults"
 | #define GNUSTEP_TARGET_USER_CONFIG_FILE ".GNUstep.conf"
 | #define GNUSTEP_TARGET_CONFIG_FILE "/usr/pkg/etc/GNUstep.conf"
 | #define GNUSTEP_TARGET_SYSTEM_APPS "/usr/pkg/lib/GNUstep/Applications"
 | #define GNUSTEP_TARGET_SYSTEM_ADMIN_APPS "/usr/pkg/lib/GNUstep/Applications"
 | #define GNUSTEP_TARGET_SYSTEM_WEB_APPS "/usr/pkg/lib/GNUstep/WebApplications"
 | #define GNUSTEP_TARGET_SYSTEM_TOOLS "/usr/pkg/bin"
 | #define GNUSTEP_TARGET_SYSTEM_ADMIN_TOOLS "/usr/pkg/sbin"
 | #define GNUSTEP_TARGET_SYSTEM_LIBRARY "/usr/pkg/lib/GNUstep"
 | #define GNUSTEP_TARGET_SYSTEM_LIBRARIES "/usr/pkg/lib"
 | #define GNUSTEP_TARGET_SYSTEM_HEADERS "/usr/pkg/include"
 | #define GNUSTEP_TARGET_SYSTEM_DOC "/usr/pkg/share/GNUstep/Documentation"
 | #define GNUSTEP_TARGET_SYSTEM_DOC_MAN "/usr/pkg/man"
 | #define GNUSTEP_TARGET_SYSTEM_DOC_INFO "/usr/pkg/info"
 | #define GNUSTEP_TARGET_NETWORK_APPS "/usr/pkg/lib/GNUstep/Applications"
 | #define GNUSTEP_TARGET_NETWORK_ADMIN_APPS "/usr/pkg/lib/GNUstep/Applications"
 | #define GNUSTEP_TARGET_NETWORK_WEB_APPS "/usr/pkg/lib/GNUstep/WebApplications"
 | #define GNUSTEP_TARGET_NETWORK_TOOLS "/usr/pkg/bin"
 | #define GNUSTEP_TARGET_NETWORK_ADMIN_TOOLS "/usr/pkg/sbin"
 | #define GNUSTEP_TARGET_NETWORK_LIBRARY "/usr/pkg/lib/GNUstep"
 | #define GNUSTEP_TARGET_NETWORK_LIBRARIES "/usr/pkg/lib"
 | #define GNUSTEP_TARGET_NETWORK_HEADERS "/usr/pkg/include"
 | #define GNUSTEP_TARGET_NETWORK_DOC "/usr/pkg/share/GNUstep/Documentation"
 | #define GNUSTEP_TARGET_NETWORK_DOC_MAN "/usr/pkg/man"
 | #define GNUSTEP_TARGET_NETWORK_DOC_INFO "/usr/pkg/info"
 | #define GNUSTEP_TARGET_LOCAL_APPS "/usr/pkg/lib/GNUstep/Applications"
 | #define GNUSTEP_TARGET_LOCAL_ADMIN_APPS "/usr/pkg/lib/GNUstep/Applications"
 | #define GNUSTEP_TARGET_LOCAL_WEB_APPS "/usr/pkg/lib/GNUstep/WebApplications"
 | #define GNUSTEP_TARGET_LOCAL_TOOLS "/usr/pkg/bin"
 | #define GNUSTEP_TARGET_LOCAL_ADMIN_TOOLS "/usr/pkg/sbin"
 | #define GNUSTEP_TARGET_LOCAL_LIBRARY "/usr/pkg/lib/GNUstep"
 | #define GNUSTEP_TARGET_LOCAL_LIBRARIES "/usr/pkg/lib"
 | #define GNUSTEP_TARGET_LOCAL_HEADERS "/usr/pkg/include"
 | #define GNUSTEP_TARGET_LOCAL_DOC "/usr/pkg/share/GNUstep/Documentation"
 | #define GNUSTEP_TARGET_LOCAL_DOC_MAN "/usr/pkg/man"
 | #define GNUSTEP_TARGET_LOCAL_DOC_INFO "/usr/pkg/info"
 | #define GNUSTEP_TARGET_USER_DIR_APPS "GNUstep/Applications"
 | #define GNUSTEP_TARGET_USER_DIR_ADMIN_APPS "GNUstep/Applications/Admin"
 | #define GNUSTEP_TARGET_USER_DIR_WEB_APPS "GNUstep/WebApplications"
 | #define GNUSTEP_TARGET_USER_DIR_TOOLS "GNUstep/Tools"
 | #define GNUSTEP_TARGET_USER_DIR_ADMIN_TOOLS "GNUstep/Tools/Admin"
 | #define GNUSTEP_TARGET_USER_DIR_LIBRARY "GNUstep/Library"
 | #define GNUSTEP_TARGET_USER_DIR_LIBRARIES "GNUstep/Library/Libraries"
 | #define GNUSTEP_TARGET_USER_DIR_HEADERS "GNUstep/Library/Headers"
 | #define GNUSTEP_TARGET_USER_DIR_DOC "GNUstep/Library/Documentation"
 | #define GNUSTEP_TARGET_USER_DIR_DOC_MAN "GNUstep/Library/Documentation/man"
 | #define GNUSTEP_TARGET_USER_DIR_DOC_INFO "GNUstep/Library/Documentation/info"
 | #define GNUSTEP_TARGET_SYSTEM_USERS_DIR ""
 | #define GNUSTEP_TARGET_NETWORK_USERS_DIR ""
 | #define GNUSTEP_TARGET_LOCAL_USERS_DIR ""
 | /* end confdefs.h.  */
 | 
 | int
 | main ()
 | {
 | 
 |   ;
 |   return 0;
 | }
 configure:3775: error: in `/usr/pkgsrc_current/devel/gnustep-base/work/gnustep-base-1.24.0':
 configure:3777: error: C compiler cannot create executables
 See `config.log' for more details.

 ## ---------------- ##
 ## Cache variables. ##
 ## ---------------- ##

 ac_cv_build=i486--netbsdelf
 ac_cv_env_CC_set=set
 ac_cv_env_CC_value=gcc
 ac_cv_env_CFLAGS_set=set
 ac_cv_env_CFLAGS_value='-O2 -I/usr/pkg/include -I/usr/pkg/share/GNUstep/include -I/usr/include'
 ac_cv_env_CPPFLAGS_set=set
 ac_cv_env_CPPFLAGS_value='-I/usr/pkg/include -I/usr/pkg/share/GNUstep/include -I/usr/include'
 ac_cv_env_CPP_set=
 ac_cv_env_CPP_value=
 ac_cv_env_LDFLAGS_set=set
 ac_cv_env_LDFLAGS_value='-L/usr/pkg/lib -L/usr/pkg/share/GNUstep/lib -Wl,-rpath,/usr/pkg/lib -Wl,-rpath,/usr/pkg/share/GNUstep/lib -L/usr/lib -Wl,-rpath,/usr/lib -lobjc -lpthread'
 ac_cv_env_LIBS_set=set
 ac_cv_env_LIBS_value=
 ac_cv_env_build_alias_set=set
 ac_cv_env_build_alias_value=i486--netbsdelf
 ac_cv_env_host_alias_set=set
 ac_cv_env_host_alias_value=i486--netbsdelf
 ac_cv_env_target_alias_set=
 ac_cv_env_target_alias_value=
 ac_cv_environment_config_file=yes
 ac_cv_host=i486--netbsdelf
 ac_cv_importing_config_file=yes
 ac_cv_path_CAT=/bin/cat
 ac_cv_path_ECHO=echo
 ac_cv_path_EGREP=/usr/bin/egrep
 ac_cv_path_ENV=/usr/bin/env
 ac_cv_path_FALSE=false
 ac_cv_path_GREP=/usr/bin/grep
 ac_cv_path_TEST=test
 ac_cv_path_TRUE=true
 ac_cv_prog_CC=gcc
 ac_cv_target=i486--netbsdelf
 gt_cv_func_gnugettext1_libintl=yes
 gt_cv_func_gnugettext2_libintl=yes
 gt_cv_func_gnugettext_libintl=yes

 ## ----------------- ##
 ## Output variables. ##
 ## ----------------- ##

 BASE_NATIVE_OBJC_EXCEPTIONS=''
 BASE_NONFRAGILE_ABI='1'
 CC='gcc'
 CFLAGS='-O2 -I/usr/pkg/include -I/usr/pkg/share/GNUstep/include -I/usr/include'
 CPP=''
 CPPFLAGS='-I/usr/pkg/include -I/usr/pkg/share/GNUstep/include -I/usr/include -I/usr/pkg/include -I/usr/pkg/include -I/usr/pkg/include'
 DEFINE_INT16_T=''
 DEFINE_INT32_T=''
 DEFINE_INT64_T=''
 DEFINE_INT8_T=''
 DEFINE_INTPTR_T=''
 DEFINE_UINT16_T=''
 DEFINE_UINT32_T=''
 DEFINE_UINT64_T=''
 DEFINE_UINT8_T=''
 DEFINE_UINTPTR_T=''
 DEFS=''
 DYNAMIC_LINKER=''
 ECHO_C=''
 ECHO_N='-n'
 ECHO_T=''
 EGREP='/usr/bin/egrep'
 EXEEXT=''
 GCC_VERSION=''
 GNUSTEP_BASE_DOMAIN='LOCAL'
 GNUSTEP_BASE_RELATIVE_PATHS='no'
 GNUSTEP_GDOMAP_PORT_OVERRIDE=''
 GNUSTEP_INSTALL_GDOMAP_AS_SETUID=''
 GREP='/usr/bin/grep'
 GS_ALIGNOF_COND_T=''
 GS_ALIGNOF_MUTEX_T=''
 GS_EXEC_CHARSET=''
 GS_FAKE_MAIN=''
 GS_FLT32=''
 GS_FLT64=''
 GS_HAVE_I128=''
 GS_HAVE_I64=''
 GS_INPUT_CHARSET=''
 GS_MIXEDABI=''
 GS_NONFRAGILE=''
 GS_PASS_ARGUMENTS=''
 GS_SADDR=''
 GS_SINT128=''
 GS_SINT16=''
 GS_SINT32=''
 GS_SINT64=''
 GS_SINT8=''
 GS_SIZEOF_COND_T=''
 GS_SIZEOF_MUTEX_T=''
 GS_UADDR=''
 GS_UINT128=''
 GS_UINT16=''
 GS_UINT32=''
 GS_UINT64=''
 GS_UINT8=''
 GS_WORDS_BIGENDIAN=''
 HAVE_AVAHI=''
 HAVE_BLOCKS=''
 HAVE_GNUTLS=''
 HAVE_ICU=''
 HAVE_INET_NTOP=''
 HAVE_INET_PTON=''
 HAVE_LIBXML=''
 HAVE_LIBXSLT=''
 HAVE_MDNS=''
 HAVE_OBJC_SYNC_ENTER=''
 HAVE_PTS_STREAM_MODULES=''
 ICU_CONFIG=''
 ICU_LIBS=''
 INCLUDE_FLAGS=''
 INCLUDE_STDINT=''
 LDFLAGS='-L/usr/pkg/lib -L/usr/pkg/share/GNUstep/lib -Wl,-rpath,/usr/pkg/lib -Wl,-rpath,/usr/pkg/share/GNUstep/lib -L/usr/lib -Wl,-rpath,/usr/lib -lobjc -lpthread -L/usr/pkg/lib -L/usr/pkg/lib -L/usr/pkg/lib'
 LDIR_FLAGS=''
 LIBOBJS=''
 LIBS=''
 LTLIBOBJS=''
 MAJOR_VERSION=''
 MINOR_VERSION=''
 NX_CONST_STRING_CLASS=''
 NX_CONST_STRING_OBJCFLAGS=''
 OBJC2RUNTIME=''
 OBJCFLAGS=''
 OBJCSYNC=''
 OBJC_WITH_GC=''
 OBJEXT=''
 PACKAGE_BUGREPORT=''
 PACKAGE_NAME=''
 PACKAGE_STRING=''
 PACKAGE_TARNAME=''
 PACKAGE_VERSION=''
 PATH_SEPARATOR=':'
 PKGCONFIG=''
 SHELL='/bin/sh'
 SUBMINOR_VERSION=''
 TLS_CFLAGS=''
 TLS_CONFIG=''
 TLS_LIBS=''
 USE_GMP=''
 USE_ZLIB=''
 VERSION=''
 WARN_FLAGS=''
 WHOAMI=''
 WITH_FFI=''
 XML2_CONFIG=''
 XML_CFLAGS=''
 XML_CONFIG=''
 XML_LIBS=''
 _GSC_S_INT=''
 _GSC_S_LNG=''
 _GSC_S_LNG_LNG=''
 _GSC_S_SHT=''
 ac_ct_CC=''
 ac_cv_sizeof_double=''
 ac_cv_sizeof_float=''
 ac_cv_sizeof_int=''
 ac_cv_sizeof_long=''
 ac_cv_sizeof_long_long=''
 ac_cv_sizeof_short=''
 ac_cv_sizeof_voidp=''
 bindir='${exec_prefix}/bin'
 build='i486--netbsdelf'
 build_alias='i486--netbsdelf'
 build_cpu='i486'
 build_os='netbsdelf'
 build_vendor=''
 datadir='${datarootdir}'
 datarootdir='${prefix}/share'
 docdir='${datarootdir}/doc/${PACKAGE}'
 dvidir='${docdir}'
 exec_prefix='/usr/pkg/libexec/GNUstep'
 host='i486--netbsdelf'
 host_alias='i486--netbsdelf'
 host_cpu='i486'
 host_os='netbsdelf'
 host_vendor=''
 htmldir='${docdir}'
 includedir='${prefix}/include'
 infodir='${datarootdir}/info'
 libdir='${exec_prefix}/lib'
 libexecdir='${exec_prefix}/libexec'
 localedir='${datarootdir}/locale'
 localstatedir='${prefix}/var'
 mandir='/usr/pkg/man'
 oldincludedir='/usr/include'
 pdfdir='${docdir}'
 prefix='/usr/pkg'
 program_transform_name='s,x,x,'
 psdir='${docdir}'
 sbindir='${exec_prefix}/sbin'
 sharedstatedir='${prefix}/com'
 subdirs=''
 sysconfdir='${prefix}/etc'
 target='i486--netbsdelf'
 target_alias=''
 target_cpu='i486'
 target_os='netbsdelf'
 target_vendor=''

 ## ----------- ##
 ## confdefs.h. ##
 ## ----------- ##

 #define PACKAGE_NAME ""
 #define PACKAGE_TARNAME ""
 #define PACKAGE_VERSION ""
 #define PACKAGE_STRING ""
 #define PACKAGE_BUGREPORT ""
 #define OPTION_NO_ENVIRONMENT 0
 #define GNUSTEP_TARGET_MAKEFILES "/usr/pkg/share/GNUstep/Makefiles"
 #define GNUSTEP_TARGET_USER_DEFAULTS_DIR "GNUstep/Defaults"
 #define GNUSTEP_TARGET_USER_CONFIG_FILE ".GNUstep.conf"
 #define GNUSTEP_TARGET_CONFIG_FILE "/usr/pkg/etc/GNUstep.conf"
 #define GNUSTEP_TARGET_SYSTEM_APPS "/usr/pkg/lib/GNUstep/Applications"
 #define GNUSTEP_TARGET_SYSTEM_ADMIN_APPS "/usr/pkg/lib/GNUstep/Applications"
 #define GNUSTEP_TARGET_SYSTEM_WEB_APPS "/usr/pkg/lib/GNUstep/WebApplications"
 #define GNUSTEP_TARGET_SYSTEM_TOOLS "/usr/pkg/bin"
 #define GNUSTEP_TARGET_SYSTEM_ADMIN_TOOLS "/usr/pkg/sbin"
 #define GNUSTEP_TARGET_SYSTEM_LIBRARY "/usr/pkg/lib/GNUstep"
 #define GNUSTEP_TARGET_SYSTEM_LIBRARIES "/usr/pkg/lib"
 #define GNUSTEP_TARGET_SYSTEM_HEADERS "/usr/pkg/include"
 #define GNUSTEP_TARGET_SYSTEM_DOC "/usr/pkg/share/GNUstep/Documentation"
 #define GNUSTEP_TARGET_SYSTEM_DOC_MAN "/usr/pkg/man"
 #define GNUSTEP_TARGET_SYSTEM_DOC_INFO "/usr/pkg/info"
 #define GNUSTEP_TARGET_NETWORK_APPS "/usr/pkg/lib/GNUstep/Applications"
 #define GNUSTEP_TARGET_NETWORK_ADMIN_APPS "/usr/pkg/lib/GNUstep/Applications"
 #define GNUSTEP_TARGET_NETWORK_WEB_APPS "/usr/pkg/lib/GNUstep/WebApplications"
 #define GNUSTEP_TARGET_NETWORK_TOOLS "/usr/pkg/bin"
 #define GNUSTEP_TARGET_NETWORK_ADMIN_TOOLS "/usr/pkg/sbin"
 #define GNUSTEP_TARGET_NETWORK_LIBRARY "/usr/pkg/lib/GNUstep"
 #define GNUSTEP_TARGET_NETWORK_LIBRARIES "/usr/pkg/lib"
 #define GNUSTEP_TARGET_NETWORK_HEADERS "/usr/pkg/include"
 #define GNUSTEP_TARGET_NETWORK_DOC "/usr/pkg/share/GNUstep/Documentation"
 #define GNUSTEP_TARGET_NETWORK_DOC_MAN "/usr/pkg/man"
 #define GNUSTEP_TARGET_NETWORK_DOC_INFO "/usr/pkg/info"
 #define GNUSTEP_TARGET_LOCAL_APPS "/usr/pkg/lib/GNUstep/Applications"
 #define GNUSTEP_TARGET_LOCAL_ADMIN_APPS "/usr/pkg/lib/GNUstep/Applications"
 #define GNUSTEP_TARGET_LOCAL_WEB_APPS "/usr/pkg/lib/GNUstep/WebApplications"
 #define GNUSTEP_TARGET_LOCAL_TOOLS "/usr/pkg/bin"
 #define GNUSTEP_TARGET_LOCAL_ADMIN_TOOLS "/usr/pkg/sbin"
 #define GNUSTEP_TARGET_LOCAL_LIBRARY "/usr/pkg/lib/GNUstep"
 #define GNUSTEP_TARGET_LOCAL_LIBRARIES "/usr/pkg/lib"
 #define GNUSTEP_TARGET_LOCAL_HEADERS "/usr/pkg/include"
 #define GNUSTEP_TARGET_LOCAL_DOC "/usr/pkg/share/GNUstep/Documentation"
 #define GNUSTEP_TARGET_LOCAL_DOC_MAN "/usr/pkg/man"
 #define GNUSTEP_TARGET_LOCAL_DOC_INFO "/usr/pkg/info"
 #define GNUSTEP_TARGET_USER_DIR_APPS "GNUstep/Applications"
 #define GNUSTEP_TARGET_USER_DIR_ADMIN_APPS "GNUstep/Applications/Admin"
 #define GNUSTEP_TARGET_USER_DIR_WEB_APPS "GNUstep/WebApplications"
 #define GNUSTEP_TARGET_USER_DIR_TOOLS "GNUstep/Tools"
 #define GNUSTEP_TARGET_USER_DIR_ADMIN_TOOLS "GNUstep/Tools/Admin"
 #define GNUSTEP_TARGET_USER_DIR_LIBRARY "GNUstep/Library"
 #define GNUSTEP_TARGET_USER_DIR_LIBRARIES "GNUstep/Library/Libraries"
 #define GNUSTEP_TARGET_USER_DIR_HEADERS "GNUstep/Library/Headers"
 #define GNUSTEP_TARGET_USER_DIR_DOC "GNUstep/Library/Documentation"
 #define GNUSTEP_TARGET_USER_DIR_DOC_MAN "GNUstep/Library/Documentation/man"
 #define GNUSTEP_TARGET_USER_DIR_DOC_INFO "GNUstep/Library/Documentation/info"
 #define GNUSTEP_TARGET_SYSTEM_USERS_DIR ""
 #define GNUSTEP_TARGET_NETWORK_USERS_DIR ""
 #define GNUSTEP_TARGET_LOCAL_USERS_DIR ""

 configure: exit 77

 --------------020104090003060304010805--

From: Bernd Ernesti <netbsd@lists.veego.de>
To: gnats-bugs@NetBSD.org
Cc: 
Subject: Re: pkg/47259: current devel/gnustep-base does not buils
Date: Sat, 8 Dec 2012 22:52:39 +0100

 You should have mentioned that you use clang and not gcc.
 This looks like a clang issue.

From: John Marino <netbsd@marino.st>
To: gnats-bugs@NetBSD.org
Cc: 
Subject: Re: pkg/47259: current devel/gnustep-base does not build
Date: Sun, 09 Dec 2012 12:21:27 +0100

 While the originator may indeed have a problem with Clang, it should be 
 noted that devel/gnustep-base does not build on *any* platform and 
 indeed is often the #1 source of break by causing 21 indirect failures.

 Look at every recent bulk build -- devel/gnustep-base doesn't build 
 anywhere.

From: David Holland <dholland-pbugs@netbsd.org>
To: gnats-bugs@NetBSD.org
Cc: 
Subject: Re: pkg/47259: current devel/gnustep-base does not build
Date: Sun, 9 Dec 2012 18:56:43 +0000

 On Sun, Dec 09, 2012 at 11:25:03AM +0000, John Marino wrote:
  >  While the originator may indeed have a problem with Clang, it should be 
  >  noted that devel/gnustep-base does not build on *any* platform and 
  >  indeed is often the #1 source of break by causing 21 indirect failures.
  >  
  >  Look at every recent bulk build -- devel/gnustep-base doesn't build 
  >  anywhere.

 Erm... it just built fine for me.

 Also, the problem it had earlier this fall (after the libxml2 update)
 wasn't the same as the problem in this PR.

 -- 
 David A. Holland
 dholland@netbsd.org

From: =?ISO-8859-15?Q?Helge_M=FChlmeier?= <h_muehlmeier@gmx.de>
To: gnats-bugs@NetBSD.org
Cc: David Holland <dholland-pbugs@netbsd.org>, rh@NetBSD.org, 
 gnats-admin@netbsd.org, pkgsrc-bugs@netbsd.org
Subject: Re: pkg/47259: current devel/gnustep-base does not build
Date: Tue, 11 Dec 2012 06:21:59 +0100

 Am 09.12.2012 20:00, schrieb David Holland:
 > The following reply was made to PR pkg/47259; it has been noted by GNATS.
 >
 > From: David Holland <dholland-pbugs@netbsd.org>
 > To: gnats-bugs@NetBSD.org
 > Cc:
 > Subject: Re: pkg/47259: current devel/gnustep-base does not build
 > Date: Sun, 9 Dec 2012 18:56:43 +0000
 >
 >   On Sun, Dec 09, 2012 at 11:25:03AM +0000, John Marino wrote:
 >    >  While the originator may indeed have a problem with Clang, it should be
 >    >  noted that devel/gnustep-base does not build on *any* platform and
 >    >  indeed is often the #1 source of break by causing 21 indirect failures.
 >    >
 >    >  Look at every recent bulk build -- devel/gnustep-base doesn't build
 >    >  anywhere.
 >   
 >   Erm... it just built fine for me.
 >   
 >   Also, the problem it had earlier this fall (after the libxml2 update)
 >   wasn't the same as the problem in this PR.
 Hi,

 this hapend on a fresh installed NetBSD 6 on i386 (sandpoint-port too) 
 with fresh fetched pkgsrc-current as I tried to build wwww/SOGo. The 
 gnustep-base package gave me the error describend in PR pkg/47259 and I 
 installed clang as a dependency... I still doesn't build...
 I think if there is a clang problem others should reproduce this issue...

 Greetings,
 Helge

From: David Holland <dholland-pbugs@netbsd.org>
To: gnats-bugs@NetBSD.org
Cc: 
Subject: Re: pkg/47259: current devel/gnustep-base does not build
Date: Tue, 11 Dec 2012 05:35:43 +0000

 On Tue, Dec 11, 2012 at 05:25:02AM +0000, Helge M?hlmeier wrote:
  >  >  >  Look at every recent bulk build -- devel/gnustep-base doesn't build
  >  >  >  anywhere.
  >  >   
  >  >   Erm... it just built fine for me.
  >  >   
  >  >   Also, the problem it had earlier this fall (after the libxml2 update)
  >  >   wasn't the same as the problem in this PR.
  >
  >  Hi,
  >  
  >  this hapend on a fresh installed NetBSD 6 on i386 (sandpoint-port too) 
  >  with fresh fetched pkgsrc-current as I tried to build wwww/SOGo. The 
  >  gnustep-base package gave me the error describend in PR pkg/47259 and I 
  >  installed clang as a dependency... I still doesn't build...
  >  I think if there is a clang problem others should reproduce this issue...

 Yeah, my build installed clang too. It was, however, on NetBSD-current
 on amd64.

 I don't think it's you; it's probably either something about i386 or
 something about 6.0...

 -- 
 David A. Holland
 dholland@netbsd.org

From: John Marino <netbsd@marino.st>
To: gnats-bugs@NetBSD.org, David Holland <dholland-pbugs@netbsd.org>
Cc: 
Subject: Re: pkg/47259: current devel/gnustep-base does not build
Date: Tue, 11 Dec 2012 16:40:36 +0100

 David Holland wrote:
 >  Yeah, my build installed clang too. It was, however, on NetBSD-current
 >  on amd64.
 >
 >  I don't think it's you; it's probably either something about i386 or
 >  something about 6.0...


 After you wrote gnustep is building, it's still failing on bulk build 
 reports, including this x86_64 NetBSD one from 9 Dec:
 http://mail-index.netbsd.org/pkgsrc-bulk/2012/12/09/msg009305.html

 That one used gcc.

 I was serious when I said it said it was failing everywhere, I checked 
 several bulk reports.  However, Joerg's last clang report from 8 
 december doesn't show it failed:
 http://mail-index.netbsd.org/pkgsrc-bulk/2012/12/11/msg009306.html

 I started a build at home yesterday, hopefully I will have a new report 
 to check gnustep status soon.

 John

From: David Holland <dholland-pbugs@netbsd.org>
To: gnats-bugs@NetBSD.org
Cc: 
Subject: Re: pkg/47259: current devel/gnustep-base does not build
Date: Tue, 11 Dec 2012 15:51:42 +0000

 On Tue, Dec 11, 2012 at 03:45:05PM +0000, John Marino wrote:
  >  >  Yeah, my build installed clang too. It was, however, on NetBSD-current
  >  >  on amd64.
  >  >
  >  >  I don't think it's you; it's probably either something about i386 or
  >  >  something about 6.0...
  >  
  >  
  >  After you wrote gnustep is building, it's still failing on bulk build 
  >  reports, including this x86_64 NetBSD one from 9 Dec:
  >  http://mail-index.netbsd.org/pkgsrc-bulk/2012/12/09/msg009305.html
  >  
  >  That one used gcc.

 That's the same libxml2 problem that started earlier this fall, which
 is not the problem in this PR.

 -- 
 David A. Holland
 dholland@netbsd.org

From: David Holland <dholland-pbugs@netbsd.org>
To: gnats-bugs@netbsd.org
Cc: 
Subject: Re: pkg/47259: current devel/gnustep-base does not build
Date: Tue, 11 Dec 2012 15:58:48 +0000

 On Tue, Dec 11, 2012 at 03:55:02PM +0000, David Holland wrote:
  >>>  Yeah, my build installed clang too. It was, however, on NetBSD-current
  >>>  on amd64.
  >>>
  >>>  I don't think it's you; it's probably either something about i386 or
  >>>  something about 6.0...
  >>
  >>
  >>  After you wrote gnustep is building, it's still failing on bulk build 
  >>  reports, including this x86_64 NetBSD one from 9 Dec:
  >>  http://mail-index.netbsd.org/pkgsrc-bulk/2012/12/09/msg009305.html
  >>  
  >>  That one used gcc.
  >  
  >  That's the same libxml2 problem that started earlier this fall, which
  >  is not the problem in this PR.

 Also, I used to get that problem in the environment that built it
 successfully the other day. I don't know what's changed, I haven't
 been following pkgsrc-changes much the last couple months.

 -- 
 David A. Holland
 dholland@netbsd.org

From: John Marino <netbsd@marino.st>
To: gnats-bugs@NetBSD.org
Cc: 
Subject: Re: pkg/47259 : Perhaps clang shouldn't be required
Date: Tue, 08 Jan 2013 10:48:25 +0100

 I know for a fact that gcc 4.7 objc can build gnustep v1.24.0 without 
 any issue.

 gnustep base requires clang, which as this PR show, can't even build 
 gnustep-base on i386.

 Can we consider reworking this package to suck in Clang only if it's 
 required?  Unfortunately, a couple of gnustep mk files are hardcoded 
 with clang.

 At the very, very least, this i386 " undefined reference to 
 `__i686.get_pc_thunk.bx'" problem has to be fixed.  It's been broken for 
 a few months now.  Is anybody working on this regression?

From: Onno van der Linden <o.vd.linden@quicknet.nl>
To: gnats-bugs@netbsd.org
Cc: 
Subject: Re: pkg/47259: current devel/gnustep-base does not build
Date: Sun, 3 Feb 2013 14:02:40 +0100

 > At the very, very least, this i386 " undefined reference to 
 > `__i686.get_pc_thunk.bx'" problem has to be fixed.  It's been broken for 
 > a few months now.  Is anybody working on this regression?

 Fix from the gnustep libobjc2 svn trunk:

 http://svn.gna.org/viewcvs/gnustep/libs/libobjc2/trunk/objc_msgSend.x86-32.S?view=patch&r1=35137&r2=35970&sortby=date

 --- libs/libobjc2/trunk/objc_msgSend.x86-32.S	2012/05/04 13:28:08	35137
 +++ libs/libobjc2/trunk/objc_msgSend.x86-32.S	2013/01/14 14:59:01	35970
 @@ -76,11 +76,14 @@


  	jmp   *%eax
 -6:                                        # smallObject:
 +6:                                       # smallObject:
  	push  %ebx                           # Save old %ebx
 -	call  __i686.get_pc_thunk.bx
 -	addl  $_GLOBAL_OFFSET_TABLE_, %ebx
 -	mov   SmallObjectClasses@GOT(%ebx), %eax
 +	calll 7f
 +7:
 +	popl  %ebx;
 +8:
 +	addl  $_GLOBAL_OFFSET_TABLE_+(8b-7b), %ebx
 +	leal  SmallObjectClasses@GOTOFF(%ebx), %eax
  	mov   (%eax), %eax
  	popl  %ebx
  	jmp   1b

Responsible-Changed-From-To: rh->pkg-manager
Responsible-Changed-By: wiz@NetBSD.org
Responsible-Changed-When: Mon, 23 Dec 2013 11:40:38 +0000
Responsible-Changed-Why:
resigned, back to role account


>Unformatted:

NetBSD Home
NetBSD PR Database Search

(Contact us) $NetBSD: query-full-pr,v 1.39 2013/11/01 18:47:49 spz Exp $
$NetBSD: gnats_config.sh,v 1.8 2006/05/07 09:23:38 tsutsui Exp $
Copyright © 1994-2007 The NetBSD Foundation, Inc. ALL RIGHTS RESERVED.