NetBSD Problem Report #52178

From www@NetBSD.org  Tue Apr 18 21:02:39 2017
Return-Path: <www@NetBSD.org>
Received: from mail.netbsd.org (mail.netbsd.org [199.233.217.200])
	(using TLSv1.2 with cipher ECDHE-RSA-AES256-GCM-SHA384 (256/256 bits))
	(Client CN "mail.netbsd.org", Issuer "Postmaster NetBSD.org" (verified OK))
	by mollari.NetBSD.org (Postfix) with ESMTPS id 87EAE7A1FA
	for <gnats-bugs@gnats.NetBSD.org>; Tue, 18 Apr 2017 21:02:39 +0000 (UTC)
Message-Id: <20170418210235.656BE7A28E@mollari.NetBSD.org>
Date: Tue, 18 Apr 2017 21:02:35 +0000 (UTC)
From: aikchar@codeghar.com
Reply-To: aikchar@codeghar.com
To: gnats-bugs@NetBSD.org
Subject: Building lang/go14 on Raspberry Pi 2 on Ubuntu 16.04 fails with error '/bin/mv: cannot stat ...'
X-Send-Pr-Version: www-1.0

>Number:         52178
>Category:       pkg
>Synopsis:       Building lang/go14 on Raspberry Pi 2 on Ubuntu 16.04 fails with error '/bin/mv: cannot stat ...'
>Confidential:   no
>Severity:       non-critical
>Priority:       medium
>Responsible:    bsiegert
>State:          feedback
>Class:          sw-bug
>Submitter-Id:   net
>Arrival-Date:   Tue Apr 18 21:05:00 +0000 2017
>Closed-Date:    
>Last-Modified:  Sat Sep 16 17:50:00 +0000 2017
>Originator:     aikchar
>Release:        trunk ---- https://github.com/jsonn/pkgsrc.git ---- git rev-parse HEAD --> 0881b6da0fb236916dbf509fbdef2374a5ca5dd4
>Organization:
>Environment:
Linux rpidesktop 4.4.41-v7+ #942 SMP Mon Jan 9 15:00:25 GMT 2017 armv7l armv7l armv7l GNU/Linux
>Description:
Error messages tail:

pkg_create: lstat failed for file go14/pkg/linux_/internal/syscall.a: No such file or directory
/bin/mv: cannot stat '/home/username/pkg/usr/work/lang/go14/work/.packages/go14-1.4.3nb4.tmp.tgz': No such file or directory
*** Error code 1


Notice the path go14/pkg/linux_ doesn't exist but go14/pkg/linux_arm does.

$ ls /home/username/pkg/usr/work/lang/go14/work/.destdir/home/username/pkg/go14/pkg
linux_arm  tool
>How-To-Repeat:
$ pwd
/home/username/pkgsrc/lang/go14


$ git rev-parse HEAD
0881b6da0fb236916dbf509fbdef2374a5ca5dd4


$ time bmake deinstall reinstall
===> Deinstalling for go14-1.4.3nb4
=> Bootstrap dependency digest>=20010302: found digest-20160304
===> Checking for vulnerabilities in go14-1.4.3nb4
=> Checksum SHA1 OK for go1.4.3.src.tar.gz
=> Checksum RMD160 OK for go1.4.3.src.tar.gz
=> Checksum SHA512 OK for go1.4.3.src.tar.gz
===> Installing dependencies for go14-1.4.3nb4
=> Tool dependency nbpatch-[0-9]*: found nbpatch-20151107
=> Tool dependency pax>=20040802: found pax-20080110nb2
=> Build dependency bash>=4.2nb3: found bash-4.4.012
=> Build dependency cwrappers>=20150314: found cwrappers-20170112
=> Full dependency perl>=5.0: found perl-5.24.1
===> Overriding tools for go14-1.4.3nb4
===> Extracting for go14-1.4.3nb4
===> Patching for go14-1.4.3nb4
=> Applying pkgsrc patches for go14-1.4.3nb4
===> Creating toolchain wrappers for go14-1.4.3nb4
===> Configuring for go14-1.4.3nb4
=> Replacing bash interpreter in doc/articles/wiki/test.bash doc/codewalk/run doc/progs/run doc/progs/update.bash lib/codereview/test.sh lib/time/update.bash misc/arm/a misc/benchcmp misc/cgo/errors/test.bash misc/cgo/testcdefs/test.bash misc/cgo/testgodefs/test.bash misc/cgo/testso/test.bash misc/makerelease/darwin/scripts/postinstall misc/makerelease/darwin/scripts/preinstall misc/nacl/go_nacl_386_exec misc/nacl/go_nacl_amd64p32_exec misc/nacl/go_nacl_arm_exec src/all.bash src/androidtest.bash src/clean.bash src/cmd/go/mkdoc.sh src/cmd/go/test.bash src/make.bash src/nacltest.bash src/race.bash src/run.bash src/runtime/mknacl.sh src/sudo.bash src/syscall/mkall.sh src/syscall/mkerrors.sh src/syscall/mksysnum_plan9.sh test/bench/shootout/timing.sh test/run.
WARNING: [replace-interpreter] Skipping non-existent file "misc/makerelease/darwin/scripts/postinstall".
WARNING: [replace-interpreter] Skipping non-existent file "misc/makerelease/darwin/scripts/preinstall".
=> Replacing Perl interpreter in src/net/http/cgi/testdata/test.cgi src/regexp/syntax/make_perl_groups.pl src/syscall/*.pl test/errchk.
===> Building for go14-1.4.3nb4
cd /home/username/pkg/usr/work/lang/go14/work/go/src && env GOROOT_FINAL=/home/username/pkg/go14 /bin/bash ./make.bash
# Building C bootstrap tool.
cmd/dist

# Building compilers and Go bootstrap tool for host, linux/arm.
lib9
libbio
liblink
cmd/cc
cmd/gc
cmd/5l
cmd/5a
cmd/5c
cmd/5g
runtime
errors
sync/atomic
sync
io
unicode
unicode/utf8
unicode/utf16
bytes
math
strings
strconv
bufio
sort
container/heap
encoding/base64
syscall
time
os
reflect
fmt
encoding
encoding/json
flag
path/filepath
path
io/ioutil
log
regexp/syntax
regexp
go/token
go/scanner
go/ast
go/parser
os/exec
os/signal
net/url
text/template/parse
text/template
go/doc
go/build
cmd/go

# Building packages and commands for linux/arm.
runtime
errors
sync/atomic
unicode
unicode/utf8
math
sync
sort
container/heap
encoding
io
syscall
hash
unicode/utf16
hash/crc32
container/list
crypto/subtle
crypto/cipher
bytes
strings
bufio
text/tabwriter
time
path
strconv
math/rand
crypto/hmac
internal/syscall
html
compress/bzip2
hash/adler32
container/ring
hash/crc64
hash/fnv
image/color
math/cmplx
image/color/palette
runtime/race
reflect
regexp/syntax
os
crypto
crypto/md5
encoding/base64
net/url
path/filepath
crypto/aes
regexp
io/ioutil
os/exec
crypto/rc4
crypto/sha1
crypto/sha256
fmt
encoding/binary
crypto/sha512
encoding/pem
os/signal
cmd/pprof/internal/svg
crypto/des
encoding/ascii85
encoding/base32
image
index/suffixarray
image/draw
image/jpeg
cmd/internal/goobj
cmd/internal/rsc.io/arm/armasm
cmd/internal/rsc.io/x86/x86asm
debug/dwarf
debug/gosym
debug/plan9obj
debug/elf
debug/macho
debug/pe
flag
log
go/token
encoding/json
go/scanner
encoding/xml
go/ast
text/template/parse
cmd/internal/objfile
go/parser
go/printer
cmd/addr2line
text/template
compress/flate
cmd/cgo
go/format
go/doc
compress/gzip
cmd/fix
math/big
go/build
crypto/elliptic
encoding/asn1
crypto/rand
crypto/rsa
crypto/dsa
encoding/hex
crypto/ecdsa
crypto/x509/pkix
mime
net/http/internal
runtime/pprof
cmd/nm
cmd/objdump
cmd/gofmt
cmd/pack
cmd/pprof/internal/profile
runtime/cgo
html/template
cmd/pprof/internal/tempfile
cmd/yacc
archive/tar
cmd/pprof/internal/plugin
cmd/pprof/internal/report
cmd/pprof/internal/symbolizer
cmd/pprof/internal/symbolz
archive/zip
net
compress/lzw
compress/zlib
database/sql/driver
cmd/pprof/internal/commands
database/sql
cmd/pprof/internal/driver
encoding/csv
encoding/gob
image/gif
image/png
os/user
runtime/debug
testing
testing/iotest
testing/quick
text/scanner
crypto/x509
net/textproto
log/syslog
mime/multipart
net/mail
crypto/tls
net/http
net/smtp
cmd/go
cmd/pprof/internal/fetch
expvar
net/http/cgi
cmd/pprof
net/http/cookiejar
net/http/httptest
net/http/fcgi
net/http/httputil
net/http/pprof
net/rpc
net/rpc/jsonrpc


---
Installed Go for linux/arm in /home/username/pkg/usr/work/lang/go14/work/go
Installed commands in /home/username/pkg/usr/work/lang/go14/work/go/bin

The binaries expect /home/username/pkg/usr/work/lang/go14/work/go to be copied or moved to /home/username/pkg/go14
===> Installing for go14-1.4.3nb4
=> Creating installation directories
cd /home/username/pkg/usr/work/lang/go14/work/go && rm -rf .hgignore .hgtags pkg/obj
cd /home/username/pkg/usr/work/lang/go14/work/go && pax -rw * /home/username/pkg/usr/work/lang/go14/work/.destdir/home/username/pkg/go14
find /home/username/pkg/usr/work/lang/go14/work/.destdir/home/username/pkg/go14 -name \*.orig -exec rm {} \;
=> Automatic manual page handling
pkg_create: can't stat `/home/username/pkg/usr/work/lang/go14/work/.destdir/home/username/pkg/go14/pkg/linux_/internal/syscall.a'
pkg_create: can't stat `/home/username/pkg/usr/work/lang/go14/work/.destdir/home/username/pkg/go14/pkg/linux_/archive/tar.a'
pkg_create: can't stat `/home/username/pkg/usr/work/lang/go14/work/.destdir/home/username/pkg/go14/pkg/linux_/archive/zip.a'
pkg_create: can't stat `/home/username/pkg/usr/work/lang/go14/work/.destdir/home/username/pkg/go14/pkg/linux_/bufio.a'
pkg_create: can't stat `/home/username/pkg/usr/work/lang/go14/work/.destdir/home/username/pkg/go14/pkg/linux_/bytes.a'
pkg_create: can't stat `/home/username/pkg/usr/work/lang/go14/work/.destdir/home/username/pkg/go14/pkg/linux_/cgocall.h'
pkg_create: can't stat `/home/username/pkg/usr/work/lang/go14/work/.destdir/home/username/pkg/go14/pkg/linux_/cmd/internal/goobj.a'
pkg_create: can't stat `/home/username/pkg/usr/work/lang/go14/work/.destdir/home/username/pkg/go14/pkg/linux_/cmd/internal/objfile.a'
pkg_create: can't stat `/home/username/pkg/usr/work/lang/go14/work/.destdir/home/username/pkg/go14/pkg/linux_/cmd/internal/rsc.io/arm/armasm.a'
pkg_create: can't stat `/home/username/pkg/usr/work/lang/go14/work/.destdir/home/username/pkg/go14/pkg/linux_/cmd/internal/rsc.io/x86/x86asm.a'
pkg_create: can't stat `/home/username/pkg/usr/work/lang/go14/work/.destdir/home/username/pkg/go14/pkg/linux_/cmd/pprof/internal/commands.a'
pkg_create: can't stat `/home/username/pkg/usr/work/lang/go14/work/.destdir/home/username/pkg/go14/pkg/linux_/cmd/pprof/internal/driver.a'
pkg_create: can't stat `/home/username/pkg/usr/work/lang/go14/work/.destdir/home/username/pkg/go14/pkg/linux_/cmd/pprof/internal/fetch.a'
pkg_create: can't stat `/home/username/pkg/usr/work/lang/go14/work/.destdir/home/username/pkg/go14/pkg/linux_/cmd/pprof/internal/plugin.a'
pkg_create: can't stat `/home/username/pkg/usr/work/lang/go14/work/.destdir/home/username/pkg/go14/pkg/linux_/cmd/pprof/internal/profile.a'
pkg_create: can't stat `/home/username/pkg/usr/work/lang/go14/work/.destdir/home/username/pkg/go14/pkg/linux_/cmd/pprof/internal/report.a'
pkg_create: can't stat `/home/username/pkg/usr/work/lang/go14/work/.destdir/home/username/pkg/go14/pkg/linux_/cmd/pprof/internal/svg.a'
pkg_create: can't stat `/home/username/pkg/usr/work/lang/go14/work/.destdir/home/username/pkg/go14/pkg/linux_/cmd/pprof/internal/symbolizer.a'
pkg_create: can't stat `/home/username/pkg/usr/work/lang/go14/work/.destdir/home/username/pkg/go14/pkg/linux_/cmd/pprof/internal/symbolz.a'
pkg_create: can't stat `/home/username/pkg/usr/work/lang/go14/work/.destdir/home/username/pkg/go14/pkg/linux_/cmd/pprof/internal/tempfile.a'
pkg_create: can't stat `/home/username/pkg/usr/work/lang/go14/work/.destdir/home/username/pkg/go14/pkg/linux_/compress/bzip2.a'
pkg_create: can't stat `/home/username/pkg/usr/work/lang/go14/work/.destdir/home/username/pkg/go14/pkg/linux_/compress/flate.a'
pkg_create: can't stat `/home/username/pkg/usr/work/lang/go14/work/.destdir/home/username/pkg/go14/pkg/linux_/compress/gzip.a'
pkg_create: can't stat `/home/username/pkg/usr/work/lang/go14/work/.destdir/home/username/pkg/go14/pkg/linux_/compress/lzw.a'
pkg_create: can't stat `/home/username/pkg/usr/work/lang/go14/work/.destdir/home/username/pkg/go14/pkg/linux_/compress/zlib.a'
pkg_create: can't stat `/home/username/pkg/usr/work/lang/go14/work/.destdir/home/username/pkg/go14/pkg/linux_/container/heap.a'
pkg_create: can't stat `/home/username/pkg/usr/work/lang/go14/work/.destdir/home/username/pkg/go14/pkg/linux_/container/list.a'
pkg_create: can't stat `/home/username/pkg/usr/work/lang/go14/work/.destdir/home/username/pkg/go14/pkg/linux_/container/ring.a'
pkg_create: can't stat `/home/username/pkg/usr/work/lang/go14/work/.destdir/home/username/pkg/go14/pkg/linux_/crypto.a'
pkg_create: can't stat `/home/username/pkg/usr/work/lang/go14/work/.destdir/home/username/pkg/go14/pkg/linux_/crypto/aes.a'
pkg_create: can't stat `/home/username/pkg/usr/work/lang/go14/work/.destdir/home/username/pkg/go14/pkg/linux_/crypto/cipher.a'
pkg_create: can't stat `/home/username/pkg/usr/work/lang/go14/work/.destdir/home/username/pkg/go14/pkg/linux_/crypto/des.a'
pkg_create: can't stat `/home/username/pkg/usr/work/lang/go14/work/.destdir/home/username/pkg/go14/pkg/linux_/crypto/dsa.a'
pkg_create: can't stat `/home/username/pkg/usr/work/lang/go14/work/.destdir/home/username/pkg/go14/pkg/linux_/crypto/ecdsa.a'
pkg_create: can't stat `/home/username/pkg/usr/work/lang/go14/work/.destdir/home/username/pkg/go14/pkg/linux_/crypto/elliptic.a'
pkg_create: can't stat `/home/username/pkg/usr/work/lang/go14/work/.destdir/home/username/pkg/go14/pkg/linux_/crypto/hmac.a'
pkg_create: can't stat `/home/username/pkg/usr/work/lang/go14/work/.destdir/home/username/pkg/go14/pkg/linux_/crypto/md5.a'
pkg_create: can't stat `/home/username/pkg/usr/work/lang/go14/work/.destdir/home/username/pkg/go14/pkg/linux_/crypto/rand.a'
pkg_create: can't stat `/home/username/pkg/usr/work/lang/go14/work/.destdir/home/username/pkg/go14/pkg/linux_/crypto/rc4.a'
pkg_create: can't stat `/home/username/pkg/usr/work/lang/go14/work/.destdir/home/username/pkg/go14/pkg/linux_/crypto/rsa.a'
pkg_create: can't stat `/home/username/pkg/usr/work/lang/go14/work/.destdir/home/username/pkg/go14/pkg/linux_/crypto/sha1.a'
pkg_create: can't stat `/home/username/pkg/usr/work/lang/go14/work/.destdir/home/username/pkg/go14/pkg/linux_/crypto/sha256.a'
pkg_create: can't stat `/home/username/pkg/usr/work/lang/go14/work/.destdir/home/username/pkg/go14/pkg/linux_/crypto/sha512.a'
pkg_create: can't stat `/home/username/pkg/usr/work/lang/go14/work/.destdir/home/username/pkg/go14/pkg/linux_/crypto/subtle.a'
pkg_create: can't stat `/home/username/pkg/usr/work/lang/go14/work/.destdir/home/username/pkg/go14/pkg/linux_/crypto/tls.a'
pkg_create: can't stat `/home/username/pkg/usr/work/lang/go14/work/.destdir/home/username/pkg/go14/pkg/linux_/crypto/x509.a'
pkg_create: can't stat `/home/username/pkg/usr/work/lang/go14/work/.destdir/home/username/pkg/go14/pkg/linux_/crypto/x509/pkix.a'
pkg_create: can't stat `/home/username/pkg/usr/work/lang/go14/work/.destdir/home/username/pkg/go14/pkg/linux_/database/sql.a'
pkg_create: can't stat `/home/username/pkg/usr/work/lang/go14/work/.destdir/home/username/pkg/go14/pkg/linux_/database/sql/driver.a'
pkg_create: can't stat `/home/username/pkg/usr/work/lang/go14/work/.destdir/home/username/pkg/go14/pkg/linux_/debug/dwarf.a'
pkg_create: can't stat `/home/username/pkg/usr/work/lang/go14/work/.destdir/home/username/pkg/go14/pkg/linux_/debug/elf.a'
pkg_create: can't stat `/home/username/pkg/usr/work/lang/go14/work/.destdir/home/username/pkg/go14/pkg/linux_/debug/gosym.a'
pkg_create: can't stat `/home/username/pkg/usr/work/lang/go14/work/.destdir/home/username/pkg/go14/pkg/linux_/debug/macho.a'
pkg_create: can't stat `/home/username/pkg/usr/work/lang/go14/work/.destdir/home/username/pkg/go14/pkg/linux_/debug/pe.a'
pkg_create: can't stat `/home/username/pkg/usr/work/lang/go14/work/.destdir/home/username/pkg/go14/pkg/linux_/debug/plan9obj.a'
pkg_create: can't stat `/home/username/pkg/usr/work/lang/go14/work/.destdir/home/username/pkg/go14/pkg/linux_/encoding.a'
pkg_create: can't stat `/home/username/pkg/usr/work/lang/go14/work/.destdir/home/username/pkg/go14/pkg/linux_/encoding/ascii85.a'
pkg_create: can't stat `/home/username/pkg/usr/work/lang/go14/work/.destdir/home/username/pkg/go14/pkg/linux_/encoding/asn1.a'
pkg_create: can't stat `/home/username/pkg/usr/work/lang/go14/work/.destdir/home/username/pkg/go14/pkg/linux_/encoding/base32.a'
pkg_create: can't stat `/home/username/pkg/usr/work/lang/go14/work/.destdir/home/username/pkg/go14/pkg/linux_/encoding/base64.a'
pkg_create: can't stat `/home/username/pkg/usr/work/lang/go14/work/.destdir/home/username/pkg/go14/pkg/linux_/encoding/binary.a'
pkg_create: can't stat `/home/username/pkg/usr/work/lang/go14/work/.destdir/home/username/pkg/go14/pkg/linux_/encoding/csv.a'
pkg_create: can't stat `/home/username/pkg/usr/work/lang/go14/work/.destdir/home/username/pkg/go14/pkg/linux_/encoding/gob.a'
pkg_create: can't stat `/home/username/pkg/usr/work/lang/go14/work/.destdir/home/username/pkg/go14/pkg/linux_/encoding/hex.a'
pkg_create: can't stat `/home/username/pkg/usr/work/lang/go14/work/.destdir/home/username/pkg/go14/pkg/linux_/encoding/json.a'
pkg_create: can't stat `/home/username/pkg/usr/work/lang/go14/work/.destdir/home/username/pkg/go14/pkg/linux_/encoding/pem.a'
pkg_create: can't stat `/home/username/pkg/usr/work/lang/go14/work/.destdir/home/username/pkg/go14/pkg/linux_/encoding/xml.a'
pkg_create: can't stat `/home/username/pkg/usr/work/lang/go14/work/.destdir/home/username/pkg/go14/pkg/linux_/errors.a'
pkg_create: can't stat `/home/username/pkg/usr/work/lang/go14/work/.destdir/home/username/pkg/go14/pkg/linux_/expvar.a'
pkg_create: can't stat `/home/username/pkg/usr/work/lang/go14/work/.destdir/home/username/pkg/go14/pkg/linux_/flag.a'
pkg_create: can't stat `/home/username/pkg/usr/work/lang/go14/work/.destdir/home/username/pkg/go14/pkg/linux_/fmt.a'
pkg_create: can't stat `/home/username/pkg/usr/work/lang/go14/work/.destdir/home/username/pkg/go14/pkg/linux_/funcdata.h'
pkg_create: can't stat `/home/username/pkg/usr/work/lang/go14/work/.destdir/home/username/pkg/go14/pkg/linux_/go/ast.a'
pkg_create: can't stat `/home/username/pkg/usr/work/lang/go14/work/.destdir/home/username/pkg/go14/pkg/linux_/go/build.a'
pkg_create: can't stat `/home/username/pkg/usr/work/lang/go14/work/.destdir/home/username/pkg/go14/pkg/linux_/go/doc.a'
pkg_create: can't stat `/home/username/pkg/usr/work/lang/go14/work/.destdir/home/username/pkg/go14/pkg/linux_/go/format.a'
pkg_create: can't stat `/home/username/pkg/usr/work/lang/go14/work/.destdir/home/username/pkg/go14/pkg/linux_/go/parser.a'
pkg_create: can't stat `/home/username/pkg/usr/work/lang/go14/work/.destdir/home/username/pkg/go14/pkg/linux_/go/printer.a'
pkg_create: can't stat `/home/username/pkg/usr/work/lang/go14/work/.destdir/home/username/pkg/go14/pkg/linux_/go/scanner.a'
pkg_create: can't stat `/home/username/pkg/usr/work/lang/go14/work/.destdir/home/username/pkg/go14/pkg/linux_/go/token.a'
pkg_create: can't stat `/home/username/pkg/usr/work/lang/go14/work/.destdir/home/username/pkg/go14/pkg/linux_/hash.a'
pkg_create: can't stat `/home/username/pkg/usr/work/lang/go14/work/.destdir/home/username/pkg/go14/pkg/linux_/hash/adler32.a'
pkg_create: can't stat `/home/username/pkg/usr/work/lang/go14/work/.destdir/home/username/pkg/go14/pkg/linux_/hash/crc32.a'
pkg_create: can't stat `/home/username/pkg/usr/work/lang/go14/work/.destdir/home/username/pkg/go14/pkg/linux_/hash/crc64.a'
pkg_create: can't stat `/home/username/pkg/usr/work/lang/go14/work/.destdir/home/username/pkg/go14/pkg/linux_/hash/fnv.a'
pkg_create: can't stat `/home/username/pkg/usr/work/lang/go14/work/.destdir/home/username/pkg/go14/pkg/linux_/html.a'
pkg_create: can't stat `/home/username/pkg/usr/work/lang/go14/work/.destdir/home/username/pkg/go14/pkg/linux_/html/template.a'
pkg_create: can't stat `/home/username/pkg/usr/work/lang/go14/work/.destdir/home/username/pkg/go14/pkg/linux_/image.a'
pkg_create: can't stat `/home/username/pkg/usr/work/lang/go14/work/.destdir/home/username/pkg/go14/pkg/linux_/image/color.a'
pkg_create: can't stat `/home/username/pkg/usr/work/lang/go14/work/.destdir/home/username/pkg/go14/pkg/linux_/image/color/palette.a'
pkg_create: can't stat `/home/username/pkg/usr/work/lang/go14/work/.destdir/home/username/pkg/go14/pkg/linux_/image/draw.a'
pkg_create: can't stat `/home/username/pkg/usr/work/lang/go14/work/.destdir/home/username/pkg/go14/pkg/linux_/image/gif.a'
pkg_create: can't stat `/home/username/pkg/usr/work/lang/go14/work/.destdir/home/username/pkg/go14/pkg/linux_/image/jpeg.a'
pkg_create: can't stat `/home/username/pkg/usr/work/lang/go14/work/.destdir/home/username/pkg/go14/pkg/linux_/image/png.a'
pkg_create: can't stat `/home/username/pkg/usr/work/lang/go14/work/.destdir/home/username/pkg/go14/pkg/linux_/index/suffixarray.a'
pkg_create: can't stat `/home/username/pkg/usr/work/lang/go14/work/.destdir/home/username/pkg/go14/pkg/linux_/io.a'
pkg_create: can't stat `/home/username/pkg/usr/work/lang/go14/work/.destdir/home/username/pkg/go14/pkg/linux_/io/ioutil.a'
pkg_create: can't stat `/home/username/pkg/usr/work/lang/go14/work/.destdir/home/username/pkg/go14/pkg/linux_/log.a'
pkg_create: can't stat `/home/username/pkg/usr/work/lang/go14/work/.destdir/home/username/pkg/go14/pkg/linux_/log/syslog.a'
pkg_create: can't stat `/home/username/pkg/usr/work/lang/go14/work/.destdir/home/username/pkg/go14/pkg/linux_/math.a'
pkg_create: can't stat `/home/username/pkg/usr/work/lang/go14/work/.destdir/home/username/pkg/go14/pkg/linux_/math/big.a'
pkg_create: can't stat `/home/username/pkg/usr/work/lang/go14/work/.destdir/home/username/pkg/go14/pkg/linux_/math/cmplx.a'
pkg_create: can't stat `/home/username/pkg/usr/work/lang/go14/work/.destdir/home/username/pkg/go14/pkg/linux_/math/rand.a'
pkg_create: can't stat `/home/username/pkg/usr/work/lang/go14/work/.destdir/home/username/pkg/go14/pkg/linux_/mime.a'
pkg_create: can't stat `/home/username/pkg/usr/work/lang/go14/work/.destdir/home/username/pkg/go14/pkg/linux_/mime/multipart.a'
pkg_create: can't stat `/home/username/pkg/usr/work/lang/go14/work/.destdir/home/username/pkg/go14/pkg/linux_/net.a'
pkg_create: can't stat `/home/username/pkg/usr/work/lang/go14/work/.destdir/home/username/pkg/go14/pkg/linux_/net/http.a'
pkg_create: can't stat `/home/username/pkg/usr/work/lang/go14/work/.destdir/home/username/pkg/go14/pkg/linux_/net/http/cgi.a'
pkg_create: can't stat `/home/username/pkg/usr/work/lang/go14/work/.destdir/home/username/pkg/go14/pkg/linux_/net/http/cookiejar.a'
pkg_create: can't stat `/home/username/pkg/usr/work/lang/go14/work/.destdir/home/username/pkg/go14/pkg/linux_/net/http/fcgi.a'
pkg_create: can't stat `/home/username/pkg/usr/work/lang/go14/work/.destdir/home/username/pkg/go14/pkg/linux_/net/http/httptest.a'
pkg_create: can't stat `/home/username/pkg/usr/work/lang/go14/work/.destdir/home/username/pkg/go14/pkg/linux_/net/http/httputil.a'
pkg_create: can't stat `/home/username/pkg/usr/work/lang/go14/work/.destdir/home/username/pkg/go14/pkg/linux_/net/http/internal.a'
pkg_create: can't stat `/home/username/pkg/usr/work/lang/go14/work/.destdir/home/username/pkg/go14/pkg/linux_/net/http/pprof.a'
pkg_create: can't stat `/home/username/pkg/usr/work/lang/go14/work/.destdir/home/username/pkg/go14/pkg/linux_/net/mail.a'
pkg_create: can't stat `/home/username/pkg/usr/work/lang/go14/work/.destdir/home/username/pkg/go14/pkg/linux_/net/rpc.a'
pkg_create: can't stat `/home/username/pkg/usr/work/lang/go14/work/.destdir/home/username/pkg/go14/pkg/linux_/net/rpc/jsonrpc.a'
pkg_create: can't stat `/home/username/pkg/usr/work/lang/go14/work/.destdir/home/username/pkg/go14/pkg/linux_/net/smtp.a'
pkg_create: can't stat `/home/username/pkg/usr/work/lang/go14/work/.destdir/home/username/pkg/go14/pkg/linux_/net/textproto.a'
pkg_create: can't stat `/home/username/pkg/usr/work/lang/go14/work/.destdir/home/username/pkg/go14/pkg/linux_/net/url.a'
pkg_create: can't stat `/home/username/pkg/usr/work/lang/go14/work/.destdir/home/username/pkg/go14/pkg/linux_/os.a'
pkg_create: can't stat `/home/username/pkg/usr/work/lang/go14/work/.destdir/home/username/pkg/go14/pkg/linux_/os/exec.a'
pkg_create: can't stat `/home/username/pkg/usr/work/lang/go14/work/.destdir/home/username/pkg/go14/pkg/linux_/os/signal.a'
pkg_create: can't stat `/home/username/pkg/usr/work/lang/go14/work/.destdir/home/username/pkg/go14/pkg/linux_/os/user.a'
pkg_create: can't stat `/home/username/pkg/usr/work/lang/go14/work/.destdir/home/username/pkg/go14/pkg/linux_/path.a'
pkg_create: can't stat `/home/username/pkg/usr/work/lang/go14/work/.destdir/home/username/pkg/go14/pkg/linux_/path/filepath.a'
pkg_create: can't stat `/home/username/pkg/usr/work/lang/go14/work/.destdir/home/username/pkg/go14/pkg/linux_/reflect.a'
pkg_create: can't stat `/home/username/pkg/usr/work/lang/go14/work/.destdir/home/username/pkg/go14/pkg/linux_/regexp.a'
pkg_create: can't stat `/home/username/pkg/usr/work/lang/go14/work/.destdir/home/username/pkg/go14/pkg/linux_/regexp/syntax.a'
pkg_create: can't stat `/home/username/pkg/usr/work/lang/go14/work/.destdir/home/username/pkg/go14/pkg/linux_/runtime.a'
pkg_create: can't stat `/home/username/pkg/usr/work/lang/go14/work/.destdir/home/username/pkg/go14/pkg/linux_/runtime.h'
pkg_create: can't stat `/home/username/pkg/usr/work/lang/go14/work/.destdir/home/username/pkg/go14/pkg/linux_/runtime/cgo.a'
pkg_create: can't stat `/home/username/pkg/usr/work/lang/go14/work/.destdir/home/username/pkg/go14/pkg/linux_/runtime/debug.a'
pkg_create: can't stat `/home/username/pkg/usr/work/lang/go14/work/.destdir/home/username/pkg/go14/pkg/linux_/runtime/pprof.a'
pkg_create: can't stat `/home/username/pkg/usr/work/lang/go14/work/.destdir/home/username/pkg/go14/pkg/linux_/runtime/race.a'
pkg_create: can't stat `/home/username/pkg/usr/work/lang/go14/work/.destdir/home/username/pkg/go14/pkg/linux_/sort.a'
pkg_create: can't stat `/home/username/pkg/usr/work/lang/go14/work/.destdir/home/username/pkg/go14/pkg/linux_/strconv.a'
pkg_create: can't stat `/home/username/pkg/usr/work/lang/go14/work/.destdir/home/username/pkg/go14/pkg/linux_/strings.a'
pkg_create: can't stat `/home/username/pkg/usr/work/lang/go14/work/.destdir/home/username/pkg/go14/pkg/linux_/sync.a'
pkg_create: can't stat `/home/username/pkg/usr/work/lang/go14/work/.destdir/home/username/pkg/go14/pkg/linux_/sync/atomic.a'
pkg_create: can't stat `/home/username/pkg/usr/work/lang/go14/work/.destdir/home/username/pkg/go14/pkg/linux_/syscall.a'
pkg_create: can't stat `/home/username/pkg/usr/work/lang/go14/work/.destdir/home/username/pkg/go14/pkg/linux_/testing.a'
pkg_create: can't stat `/home/username/pkg/usr/work/lang/go14/work/.destdir/home/username/pkg/go14/pkg/linux_/testing/iotest.a'
pkg_create: can't stat `/home/username/pkg/usr/work/lang/go14/work/.destdir/home/username/pkg/go14/pkg/linux_/testing/quick.a'
pkg_create: can't stat `/home/username/pkg/usr/work/lang/go14/work/.destdir/home/username/pkg/go14/pkg/linux_/text/scanner.a'
pkg_create: can't stat `/home/username/pkg/usr/work/lang/go14/work/.destdir/home/username/pkg/go14/pkg/linux_/text/tabwriter.a'
pkg_create: can't stat `/home/username/pkg/usr/work/lang/go14/work/.destdir/home/username/pkg/go14/pkg/linux_/text/template.a'
pkg_create: can't stat `/home/username/pkg/usr/work/lang/go14/work/.destdir/home/username/pkg/go14/pkg/linux_/text/template/parse.a'
pkg_create: can't stat `/home/username/pkg/usr/work/lang/go14/work/.destdir/home/username/pkg/go14/pkg/linux_/textflag.h'
pkg_create: can't stat `/home/username/pkg/usr/work/lang/go14/work/.destdir/home/username/pkg/go14/pkg/linux_/time.a'
pkg_create: can't stat `/home/username/pkg/usr/work/lang/go14/work/.destdir/home/username/pkg/go14/pkg/linux_/unicode.a'
pkg_create: can't stat `/home/username/pkg/usr/work/lang/go14/work/.destdir/home/username/pkg/go14/pkg/linux_/unicode/utf16.a'
pkg_create: can't stat `/home/username/pkg/usr/work/lang/go14/work/.destdir/home/username/pkg/go14/pkg/linux_/unicode/utf8.a'
pkg_create: can't stat `/home/username/pkg/usr/work/lang/go14/work/.destdir/home/username/pkg/go14/pkg/tool/linux_/a'
pkg_create: can't stat `/home/username/pkg/usr/work/lang/go14/work/.destdir/home/username/pkg/go14/pkg/tool/linux_/c'
pkg_create: can't stat `/home/username/pkg/usr/work/lang/go14/work/.destdir/home/username/pkg/go14/pkg/tool/linux_/g'
pkg_create: can't stat `/home/username/pkg/usr/work/lang/go14/work/.destdir/home/username/pkg/go14/pkg/tool/linux_/l'
pkg_create: can't stat `/home/username/pkg/usr/work/lang/go14/work/.destdir/home/username/pkg/go14/pkg/tool/linux_/addr2line'
pkg_create: can't stat `/home/username/pkg/usr/work/lang/go14/work/.destdir/home/username/pkg/go14/pkg/tool/linux_/cgo'
pkg_create: can't stat `/home/username/pkg/usr/work/lang/go14/work/.destdir/home/username/pkg/go14/pkg/tool/linux_/dist'
pkg_create: can't stat `/home/username/pkg/usr/work/lang/go14/work/.destdir/home/username/pkg/go14/pkg/tool/linux_/fix'
pkg_create: can't stat `/home/username/pkg/usr/work/lang/go14/work/.destdir/home/username/pkg/go14/pkg/tool/linux_/nm'
pkg_create: can't stat `/home/username/pkg/usr/work/lang/go14/work/.destdir/home/username/pkg/go14/pkg/tool/linux_/objdump'
pkg_create: can't stat `/home/username/pkg/usr/work/lang/go14/work/.destdir/home/username/pkg/go14/pkg/tool/linux_/pack'
pkg_create: can't stat `/home/username/pkg/usr/work/lang/go14/work/.destdir/home/username/pkg/go14/pkg/tool/linux_/pprof'
pkg_create: can't stat `/home/username/pkg/usr/work/lang/go14/work/.destdir/home/username/pkg/go14/pkg/tool/linux_/yacc'
pkg_create: can't stat `/home/username/pkg/usr/work/lang/go14/work/.destdir/home/username/pkg/go14/src/runtime/zasm_linux_.h'
pkg_create: can't stat `/home/username/pkg/usr/work/lang/go14/work/.destdir/home/username/pkg/go14/src/runtime/zgoarch_.go'
pkg_create: can't stat `/home/username/pkg/usr/work/lang/go14/work/.destdir/home/username/pkg/go14/src/runtime/zruntime_defs_linux_.go'
pkg_create: can't stat `/home/username/pkg/usr/work/lang/go14/work/.destdir/home/username/pkg/go14/src/runtime/zsys_linux_.s'
=> Creating binary package /home/username/pkg/usr/work/lang/go14/work/.packages/go14-1.4.3nb4.tgz
pkg_create: can't stat `/home/username/pkg/usr/work/lang/go14/work/.destdir/home/username/pkg/go14/pkg/linux_/internal/syscall.a'
pkg_create: can't stat `/home/username/pkg/usr/work/lang/go14/work/.destdir/home/username/pkg/go14/pkg/linux_/archive/tar.a'
pkg_create: can't stat `/home/username/pkg/usr/work/lang/go14/work/.destdir/home/username/pkg/go14/pkg/linux_/archive/zip.a'
pkg_create: can't stat `/home/username/pkg/usr/work/lang/go14/work/.destdir/home/username/pkg/go14/pkg/linux_/bufio.a'
pkg_create: can't stat `/home/username/pkg/usr/work/lang/go14/work/.destdir/home/username/pkg/go14/pkg/linux_/bytes.a'
pkg_create: can't stat `/home/username/pkg/usr/work/lang/go14/work/.destdir/home/username/pkg/go14/pkg/linux_/cgocall.h'
pkg_create: can't stat `/home/username/pkg/usr/work/lang/go14/work/.destdir/home/username/pkg/go14/pkg/linux_/cmd/internal/goobj.a'
pkg_create: can't stat `/home/username/pkg/usr/work/lang/go14/work/.destdir/home/username/pkg/go14/pkg/linux_/cmd/internal/objfile.a'
pkg_create: can't stat `/home/username/pkg/usr/work/lang/go14/work/.destdir/home/username/pkg/go14/pkg/linux_/cmd/internal/rsc.io/arm/armasm.a'
pkg_create: can't stat `/home/username/pkg/usr/work/lang/go14/work/.destdir/home/username/pkg/go14/pkg/linux_/cmd/internal/rsc.io/x86/x86asm.a'
pkg_create: can't stat `/home/username/pkg/usr/work/lang/go14/work/.destdir/home/username/pkg/go14/pkg/linux_/cmd/pprof/internal/commands.a'
pkg_create: can't stat `/home/username/pkg/usr/work/lang/go14/work/.destdir/home/username/pkg/go14/pkg/linux_/cmd/pprof/internal/driver.a'
pkg_create: can't stat `/home/username/pkg/usr/work/lang/go14/work/.destdir/home/username/pkg/go14/pkg/linux_/cmd/pprof/internal/fetch.a'
pkg_create: can't stat `/home/username/pkg/usr/work/lang/go14/work/.destdir/home/username/pkg/go14/pkg/linux_/cmd/pprof/internal/plugin.a'
pkg_create: can't stat `/home/username/pkg/usr/work/lang/go14/work/.destdir/home/username/pkg/go14/pkg/linux_/cmd/pprof/internal/profile.a'
pkg_create: can't stat `/home/username/pkg/usr/work/lang/go14/work/.destdir/home/username/pkg/go14/pkg/linux_/cmd/pprof/internal/report.a'
pkg_create: can't stat `/home/username/pkg/usr/work/lang/go14/work/.destdir/home/username/pkg/go14/pkg/linux_/cmd/pprof/internal/svg.a'
pkg_create: can't stat `/home/username/pkg/usr/work/lang/go14/work/.destdir/home/username/pkg/go14/pkg/linux_/cmd/pprof/internal/symbolizer.a'
pkg_create: can't stat `/home/username/pkg/usr/work/lang/go14/work/.destdir/home/username/pkg/go14/pkg/linux_/cmd/pprof/internal/symbolz.a'
pkg_create: can't stat `/home/username/pkg/usr/work/lang/go14/work/.destdir/home/username/pkg/go14/pkg/linux_/cmd/pprof/internal/tempfile.a'
pkg_create: can't stat `/home/username/pkg/usr/work/lang/go14/work/.destdir/home/username/pkg/go14/pkg/linux_/compress/bzip2.a'
pkg_create: can't stat `/home/username/pkg/usr/work/lang/go14/work/.destdir/home/username/pkg/go14/pkg/linux_/compress/flate.a'
pkg_create: can't stat `/home/username/pkg/usr/work/lang/go14/work/.destdir/home/username/pkg/go14/pkg/linux_/compress/gzip.a'
pkg_create: can't stat `/home/username/pkg/usr/work/lang/go14/work/.destdir/home/username/pkg/go14/pkg/linux_/compress/lzw.a'
pkg_create: can't stat `/home/username/pkg/usr/work/lang/go14/work/.destdir/home/username/pkg/go14/pkg/linux_/compress/zlib.a'
pkg_create: can't stat `/home/username/pkg/usr/work/lang/go14/work/.destdir/home/username/pkg/go14/pkg/linux_/container/heap.a'
pkg_create: can't stat `/home/username/pkg/usr/work/lang/go14/work/.destdir/home/username/pkg/go14/pkg/linux_/container/list.a'
pkg_create: can't stat `/home/username/pkg/usr/work/lang/go14/work/.destdir/home/username/pkg/go14/pkg/linux_/container/ring.a'
pkg_create: can't stat `/home/username/pkg/usr/work/lang/go14/work/.destdir/home/username/pkg/go14/pkg/linux_/crypto.a'
pkg_create: can't stat `/home/username/pkg/usr/work/lang/go14/work/.destdir/home/username/pkg/go14/pkg/linux_/crypto/aes.a'
pkg_create: can't stat `/home/username/pkg/usr/work/lang/go14/work/.destdir/home/username/pkg/go14/pkg/linux_/crypto/cipher.a'
pkg_create: can't stat `/home/username/pkg/usr/work/lang/go14/work/.destdir/home/username/pkg/go14/pkg/linux_/crypto/des.a'
pkg_create: can't stat `/home/username/pkg/usr/work/lang/go14/work/.destdir/home/username/pkg/go14/pkg/linux_/crypto/dsa.a'
pkg_create: can't stat `/home/username/pkg/usr/work/lang/go14/work/.destdir/home/username/pkg/go14/pkg/linux_/crypto/ecdsa.a'
pkg_create: can't stat `/home/username/pkg/usr/work/lang/go14/work/.destdir/home/username/pkg/go14/pkg/linux_/crypto/elliptic.a'
pkg_create: can't stat `/home/username/pkg/usr/work/lang/go14/work/.destdir/home/username/pkg/go14/pkg/linux_/crypto/hmac.a'
pkg_create: can't stat `/home/username/pkg/usr/work/lang/go14/work/.destdir/home/username/pkg/go14/pkg/linux_/crypto/md5.a'
pkg_create: can't stat `/home/username/pkg/usr/work/lang/go14/work/.destdir/home/username/pkg/go14/pkg/linux_/crypto/rand.a'
pkg_create: can't stat `/home/username/pkg/usr/work/lang/go14/work/.destdir/home/username/pkg/go14/pkg/linux_/crypto/rc4.a'
pkg_create: can't stat `/home/username/pkg/usr/work/lang/go14/work/.destdir/home/username/pkg/go14/pkg/linux_/crypto/rsa.a'
pkg_create: can't stat `/home/username/pkg/usr/work/lang/go14/work/.destdir/home/username/pkg/go14/pkg/linux_/crypto/sha1.a'
pkg_create: can't stat `/home/username/pkg/usr/work/lang/go14/work/.destdir/home/username/pkg/go14/pkg/linux_/crypto/sha256.a'
pkg_create: can't stat `/home/username/pkg/usr/work/lang/go14/work/.destdir/home/username/pkg/go14/pkg/linux_/crypto/sha512.a'
pkg_create: can't stat `/home/username/pkg/usr/work/lang/go14/work/.destdir/home/username/pkg/go14/pkg/linux_/crypto/subtle.a'
pkg_create: can't stat `/home/username/pkg/usr/work/lang/go14/work/.destdir/home/username/pkg/go14/pkg/linux_/crypto/tls.a'
pkg_create: can't stat `/home/username/pkg/usr/work/lang/go14/work/.destdir/home/username/pkg/go14/pkg/linux_/crypto/x509.a'
pkg_create: can't stat `/home/username/pkg/usr/work/lang/go14/work/.destdir/home/username/pkg/go14/pkg/linux_/crypto/x509/pkix.a'
pkg_create: can't stat `/home/username/pkg/usr/work/lang/go14/work/.destdir/home/username/pkg/go14/pkg/linux_/database/sql.a'
pkg_create: can't stat `/home/username/pkg/usr/work/lang/go14/work/.destdir/home/username/pkg/go14/pkg/linux_/database/sql/driver.a'
pkg_create: can't stat `/home/username/pkg/usr/work/lang/go14/work/.destdir/home/username/pkg/go14/pkg/linux_/debug/dwarf.a'
pkg_create: can't stat `/home/username/pkg/usr/work/lang/go14/work/.destdir/home/username/pkg/go14/pkg/linux_/debug/elf.a'
pkg_create: can't stat `/home/username/pkg/usr/work/lang/go14/work/.destdir/home/username/pkg/go14/pkg/linux_/debug/gosym.a'
pkg_create: can't stat `/home/username/pkg/usr/work/lang/go14/work/.destdir/home/username/pkg/go14/pkg/linux_/debug/macho.a'
pkg_create: can't stat `/home/username/pkg/usr/work/lang/go14/work/.destdir/home/username/pkg/go14/pkg/linux_/debug/pe.a'
pkg_create: can't stat `/home/username/pkg/usr/work/lang/go14/work/.destdir/home/username/pkg/go14/pkg/linux_/debug/plan9obj.a'
pkg_create: can't stat `/home/username/pkg/usr/work/lang/go14/work/.destdir/home/username/pkg/go14/pkg/linux_/encoding.a'
pkg_create: can't stat `/home/username/pkg/usr/work/lang/go14/work/.destdir/home/username/pkg/go14/pkg/linux_/encoding/ascii85.a'
pkg_create: can't stat `/home/username/pkg/usr/work/lang/go14/work/.destdir/home/username/pkg/go14/pkg/linux_/encoding/asn1.a'
pkg_create: can't stat `/home/username/pkg/usr/work/lang/go14/work/.destdir/home/username/pkg/go14/pkg/linux_/encoding/base32.a'
pkg_create: can't stat `/home/username/pkg/usr/work/lang/go14/work/.destdir/home/username/pkg/go14/pkg/linux_/encoding/base64.a'
pkg_create: can't stat `/home/username/pkg/usr/work/lang/go14/work/.destdir/home/username/pkg/go14/pkg/linux_/encoding/binary.a'
pkg_create: can't stat `/home/username/pkg/usr/work/lang/go14/work/.destdir/home/username/pkg/go14/pkg/linux_/encoding/csv.a'
pkg_create: can't stat `/home/username/pkg/usr/work/lang/go14/work/.destdir/home/username/pkg/go14/pkg/linux_/encoding/gob.a'
pkg_create: can't stat `/home/username/pkg/usr/work/lang/go14/work/.destdir/home/username/pkg/go14/pkg/linux_/encoding/hex.a'
pkg_create: can't stat `/home/username/pkg/usr/work/lang/go14/work/.destdir/home/username/pkg/go14/pkg/linux_/encoding/json.a'
pkg_create: can't stat `/home/username/pkg/usr/work/lang/go14/work/.destdir/home/username/pkg/go14/pkg/linux_/encoding/pem.a'
pkg_create: can't stat `/home/username/pkg/usr/work/lang/go14/work/.destdir/home/username/pkg/go14/pkg/linux_/encoding/xml.a'
pkg_create: can't stat `/home/username/pkg/usr/work/lang/go14/work/.destdir/home/username/pkg/go14/pkg/linux_/errors.a'
pkg_create: can't stat `/home/username/pkg/usr/work/lang/go14/work/.destdir/home/username/pkg/go14/pkg/linux_/expvar.a'
pkg_create: can't stat `/home/username/pkg/usr/work/lang/go14/work/.destdir/home/username/pkg/go14/pkg/linux_/flag.a'
pkg_create: can't stat `/home/username/pkg/usr/work/lang/go14/work/.destdir/home/username/pkg/go14/pkg/linux_/fmt.a'
pkg_create: can't stat `/home/username/pkg/usr/work/lang/go14/work/.destdir/home/username/pkg/go14/pkg/linux_/funcdata.h'
pkg_create: can't stat `/home/username/pkg/usr/work/lang/go14/work/.destdir/home/username/pkg/go14/pkg/linux_/go/ast.a'
pkg_create: can't stat `/home/username/pkg/usr/work/lang/go14/work/.destdir/home/username/pkg/go14/pkg/linux_/go/build.a'
pkg_create: can't stat `/home/username/pkg/usr/work/lang/go14/work/.destdir/home/username/pkg/go14/pkg/linux_/go/doc.a'
pkg_create: can't stat `/home/username/pkg/usr/work/lang/go14/work/.destdir/home/username/pkg/go14/pkg/linux_/go/format.a'
pkg_create: can't stat `/home/username/pkg/usr/work/lang/go14/work/.destdir/home/username/pkg/go14/pkg/linux_/go/parser.a'
pkg_create: can't stat `/home/username/pkg/usr/work/lang/go14/work/.destdir/home/username/pkg/go14/pkg/linux_/go/printer.a'
pkg_create: can't stat `/home/username/pkg/usr/work/lang/go14/work/.destdir/home/username/pkg/go14/pkg/linux_/go/scanner.a'
pkg_create: can't stat `/home/username/pkg/usr/work/lang/go14/work/.destdir/home/username/pkg/go14/pkg/linux_/go/token.a'
pkg_create: can't stat `/home/username/pkg/usr/work/lang/go14/work/.destdir/home/username/pkg/go14/pkg/linux_/hash.a'
pkg_create: can't stat `/home/username/pkg/usr/work/lang/go14/work/.destdir/home/username/pkg/go14/pkg/linux_/hash/adler32.a'
pkg_create: can't stat `/home/username/pkg/usr/work/lang/go14/work/.destdir/home/username/pkg/go14/pkg/linux_/hash/crc32.a'
pkg_create: can't stat `/home/username/pkg/usr/work/lang/go14/work/.destdir/home/username/pkg/go14/pkg/linux_/hash/crc64.a'
pkg_create: can't stat `/home/username/pkg/usr/work/lang/go14/work/.destdir/home/username/pkg/go14/pkg/linux_/hash/fnv.a'
pkg_create: can't stat `/home/username/pkg/usr/work/lang/go14/work/.destdir/home/username/pkg/go14/pkg/linux_/html.a'
pkg_create: can't stat `/home/username/pkg/usr/work/lang/go14/work/.destdir/home/username/pkg/go14/pkg/linux_/html/template.a'
pkg_create: can't stat `/home/username/pkg/usr/work/lang/go14/work/.destdir/home/username/pkg/go14/pkg/linux_/image.a'
pkg_create: can't stat `/home/username/pkg/usr/work/lang/go14/work/.destdir/home/username/pkg/go14/pkg/linux_/image/color.a'
pkg_create: can't stat `/home/username/pkg/usr/work/lang/go14/work/.destdir/home/username/pkg/go14/pkg/linux_/image/color/palette.a'
pkg_create: can't stat `/home/username/pkg/usr/work/lang/go14/work/.destdir/home/username/pkg/go14/pkg/linux_/image/draw.a'
pkg_create: can't stat `/home/username/pkg/usr/work/lang/go14/work/.destdir/home/username/pkg/go14/pkg/linux_/image/gif.a'
pkg_create: can't stat `/home/username/pkg/usr/work/lang/go14/work/.destdir/home/username/pkg/go14/pkg/linux_/image/jpeg.a'
pkg_create: can't stat `/home/username/pkg/usr/work/lang/go14/work/.destdir/home/username/pkg/go14/pkg/linux_/image/png.a'
pkg_create: can't stat `/home/username/pkg/usr/work/lang/go14/work/.destdir/home/username/pkg/go14/pkg/linux_/index/suffixarray.a'
pkg_create: can't stat `/home/username/pkg/usr/work/lang/go14/work/.destdir/home/username/pkg/go14/pkg/linux_/io.a'
pkg_create: can't stat `/home/username/pkg/usr/work/lang/go14/work/.destdir/home/username/pkg/go14/pkg/linux_/io/ioutil.a'
pkg_create: can't stat `/home/username/pkg/usr/work/lang/go14/work/.destdir/home/username/pkg/go14/pkg/linux_/log.a'
pkg_create: can't stat `/home/username/pkg/usr/work/lang/go14/work/.destdir/home/username/pkg/go14/pkg/linux_/log/syslog.a'
pkg_create: can't stat `/home/username/pkg/usr/work/lang/go14/work/.destdir/home/username/pkg/go14/pkg/linux_/math.a'
pkg_create: can't stat `/home/username/pkg/usr/work/lang/go14/work/.destdir/home/username/pkg/go14/pkg/linux_/math/big.a'
pkg_create: can't stat `/home/username/pkg/usr/work/lang/go14/work/.destdir/home/username/pkg/go14/pkg/linux_/math/cmplx.a'
pkg_create: can't stat `/home/username/pkg/usr/work/lang/go14/work/.destdir/home/username/pkg/go14/pkg/linux_/math/rand.a'
pkg_create: can't stat `/home/username/pkg/usr/work/lang/go14/work/.destdir/home/username/pkg/go14/pkg/linux_/mime.a'
pkg_create: can't stat `/home/username/pkg/usr/work/lang/go14/work/.destdir/home/username/pkg/go14/pkg/linux_/mime/multipart.a'
pkg_create: can't stat `/home/username/pkg/usr/work/lang/go14/work/.destdir/home/username/pkg/go14/pkg/linux_/net.a'
pkg_create: can't stat `/home/username/pkg/usr/work/lang/go14/work/.destdir/home/username/pkg/go14/pkg/linux_/net/http.a'
pkg_create: can't stat `/home/username/pkg/usr/work/lang/go14/work/.destdir/home/username/pkg/go14/pkg/linux_/net/http/cgi.a'
pkg_create: can't stat `/home/username/pkg/usr/work/lang/go14/work/.destdir/home/username/pkg/go14/pkg/linux_/net/http/cookiejar.a'
pkg_create: can't stat `/home/username/pkg/usr/work/lang/go14/work/.destdir/home/username/pkg/go14/pkg/linux_/net/http/fcgi.a'
pkg_create: can't stat `/home/username/pkg/usr/work/lang/go14/work/.destdir/home/username/pkg/go14/pkg/linux_/net/http/httptest.a'
pkg_create: can't stat `/home/username/pkg/usr/work/lang/go14/work/.destdir/home/username/pkg/go14/pkg/linux_/net/http/httputil.a'
pkg_create: can't stat `/home/username/pkg/usr/work/lang/go14/work/.destdir/home/username/pkg/go14/pkg/linux_/net/http/internal.a'
pkg_create: can't stat `/home/username/pkg/usr/work/lang/go14/work/.destdir/home/username/pkg/go14/pkg/linux_/net/http/pprof.a'
pkg_create: can't stat `/home/username/pkg/usr/work/lang/go14/work/.destdir/home/username/pkg/go14/pkg/linux_/net/mail.a'
pkg_create: can't stat `/home/username/pkg/usr/work/lang/go14/work/.destdir/home/username/pkg/go14/pkg/linux_/net/rpc.a'
pkg_create: can't stat `/home/username/pkg/usr/work/lang/go14/work/.destdir/home/username/pkg/go14/pkg/linux_/net/rpc/jsonrpc.a'
pkg_create: can't stat `/home/username/pkg/usr/work/lang/go14/work/.destdir/home/username/pkg/go14/pkg/linux_/net/smtp.a'
pkg_create: can't stat `/home/username/pkg/usr/work/lang/go14/work/.destdir/home/username/pkg/go14/pkg/linux_/net/textproto.a'
pkg_create: can't stat `/home/username/pkg/usr/work/lang/go14/work/.destdir/home/username/pkg/go14/pkg/linux_/net/url.a'
pkg_create: can't stat `/home/username/pkg/usr/work/lang/go14/work/.destdir/home/username/pkg/go14/pkg/linux_/os.a'
pkg_create: can't stat `/home/username/pkg/usr/work/lang/go14/work/.destdir/home/username/pkg/go14/pkg/linux_/os/exec.a'
pkg_create: can't stat `/home/username/pkg/usr/work/lang/go14/work/.destdir/home/username/pkg/go14/pkg/linux_/os/signal.a'
pkg_create: can't stat `/home/username/pkg/usr/work/lang/go14/work/.destdir/home/username/pkg/go14/pkg/linux_/os/user.a'
pkg_create: can't stat `/home/username/pkg/usr/work/lang/go14/work/.destdir/home/username/pkg/go14/pkg/linux_/path.a'
pkg_create: can't stat `/home/username/pkg/usr/work/lang/go14/work/.destdir/home/username/pkg/go14/pkg/linux_/path/filepath.a'
pkg_create: can't stat `/home/username/pkg/usr/work/lang/go14/work/.destdir/home/username/pkg/go14/pkg/linux_/reflect.a'
pkg_create: can't stat `/home/username/pkg/usr/work/lang/go14/work/.destdir/home/username/pkg/go14/pkg/linux_/regexp.a'
pkg_create: can't stat `/home/username/pkg/usr/work/lang/go14/work/.destdir/home/username/pkg/go14/pkg/linux_/regexp/syntax.a'
pkg_create: can't stat `/home/username/pkg/usr/work/lang/go14/work/.destdir/home/username/pkg/go14/pkg/linux_/runtime.a'
pkg_create: can't stat `/home/username/pkg/usr/work/lang/go14/work/.destdir/home/username/pkg/go14/pkg/linux_/runtime.h'
pkg_create: can't stat `/home/username/pkg/usr/work/lang/go14/work/.destdir/home/username/pkg/go14/pkg/linux_/runtime/cgo.a'
pkg_create: can't stat `/home/username/pkg/usr/work/lang/go14/work/.destdir/home/username/pkg/go14/pkg/linux_/runtime/debug.a'
pkg_create: can't stat `/home/username/pkg/usr/work/lang/go14/work/.destdir/home/username/pkg/go14/pkg/linux_/runtime/pprof.a'
pkg_create: can't stat `/home/username/pkg/usr/work/lang/go14/work/.destdir/home/username/pkg/go14/pkg/linux_/runtime/race.a'
pkg_create: can't stat `/home/username/pkg/usr/work/lang/go14/work/.destdir/home/username/pkg/go14/pkg/linux_/sort.a'
pkg_create: can't stat `/home/username/pkg/usr/work/lang/go14/work/.destdir/home/username/pkg/go14/pkg/linux_/strconv.a'
pkg_create: can't stat `/home/username/pkg/usr/work/lang/go14/work/.destdir/home/username/pkg/go14/pkg/linux_/strings.a'
pkg_create: can't stat `/home/username/pkg/usr/work/lang/go14/work/.destdir/home/username/pkg/go14/pkg/linux_/sync.a'
pkg_create: can't stat `/home/username/pkg/usr/work/lang/go14/work/.destdir/home/username/pkg/go14/pkg/linux_/sync/atomic.a'
pkg_create: can't stat `/home/username/pkg/usr/work/lang/go14/work/.destdir/home/username/pkg/go14/pkg/linux_/syscall.a'
pkg_create: can't stat `/home/username/pkg/usr/work/lang/go14/work/.destdir/home/username/pkg/go14/pkg/linux_/testing.a'
pkg_create: can't stat `/home/username/pkg/usr/work/lang/go14/work/.destdir/home/username/pkg/go14/pkg/linux_/testing/iotest.a'
pkg_create: can't stat `/home/username/pkg/usr/work/lang/go14/work/.destdir/home/username/pkg/go14/pkg/linux_/testing/quick.a'
pkg_create: can't stat `/home/username/pkg/usr/work/lang/go14/work/.destdir/home/username/pkg/go14/pkg/linux_/text/scanner.a'
pkg_create: can't stat `/home/username/pkg/usr/work/lang/go14/work/.destdir/home/username/pkg/go14/pkg/linux_/text/tabwriter.a'
pkg_create: can't stat `/home/username/pkg/usr/work/lang/go14/work/.destdir/home/username/pkg/go14/pkg/linux_/text/template.a'
pkg_create: can't stat `/home/username/pkg/usr/work/lang/go14/work/.destdir/home/username/pkg/go14/pkg/linux_/text/template/parse.a'
pkg_create: can't stat `/home/username/pkg/usr/work/lang/go14/work/.destdir/home/username/pkg/go14/pkg/linux_/textflag.h'
pkg_create: can't stat `/home/username/pkg/usr/work/lang/go14/work/.destdir/home/username/pkg/go14/pkg/linux_/time.a'
pkg_create: can't stat `/home/username/pkg/usr/work/lang/go14/work/.destdir/home/username/pkg/go14/pkg/linux_/unicode.a'
pkg_create: can't stat `/home/username/pkg/usr/work/lang/go14/work/.destdir/home/username/pkg/go14/pkg/linux_/unicode/utf16.a'
pkg_create: can't stat `/home/username/pkg/usr/work/lang/go14/work/.destdir/home/username/pkg/go14/pkg/linux_/unicode/utf8.a'
pkg_create: can't stat `/home/username/pkg/usr/work/lang/go14/work/.destdir/home/username/pkg/go14/pkg/tool/linux_/a'
pkg_create: can't stat `/home/username/pkg/usr/work/lang/go14/work/.destdir/home/username/pkg/go14/pkg/tool/linux_/c'
pkg_create: can't stat `/home/username/pkg/usr/work/lang/go14/work/.destdir/home/username/pkg/go14/pkg/tool/linux_/g'
pkg_create: can't stat `/home/username/pkg/usr/work/lang/go14/work/.destdir/home/username/pkg/go14/pkg/tool/linux_/l'
pkg_create: can't stat `/home/username/pkg/usr/work/lang/go14/work/.destdir/home/username/pkg/go14/pkg/tool/linux_/addr2line'
pkg_create: can't stat `/home/username/pkg/usr/work/lang/go14/work/.destdir/home/username/pkg/go14/pkg/tool/linux_/cgo'
pkg_create: can't stat `/home/username/pkg/usr/work/lang/go14/work/.destdir/home/username/pkg/go14/pkg/tool/linux_/dist'
pkg_create: can't stat `/home/username/pkg/usr/work/lang/go14/work/.destdir/home/username/pkg/go14/pkg/tool/linux_/fix'
pkg_create: can't stat `/home/username/pkg/usr/work/lang/go14/work/.destdir/home/username/pkg/go14/pkg/tool/linux_/nm'
pkg_create: can't stat `/home/username/pkg/usr/work/lang/go14/work/.destdir/home/username/pkg/go14/pkg/tool/linux_/objdump'
pkg_create: can't stat `/home/username/pkg/usr/work/lang/go14/work/.destdir/home/username/pkg/go14/pkg/tool/linux_/pack'
pkg_create: can't stat `/home/username/pkg/usr/work/lang/go14/work/.destdir/home/username/pkg/go14/pkg/tool/linux_/pprof'
pkg_create: can't stat `/home/username/pkg/usr/work/lang/go14/work/.destdir/home/username/pkg/go14/pkg/tool/linux_/yacc'
pkg_create: can't stat `/home/username/pkg/usr/work/lang/go14/work/.destdir/home/username/pkg/go14/src/runtime/zasm_linux_.h'
pkg_create: can't stat `/home/username/pkg/usr/work/lang/go14/work/.destdir/home/username/pkg/go14/src/runtime/zgoarch_.go'
pkg_create: can't stat `/home/username/pkg/usr/work/lang/go14/work/.destdir/home/username/pkg/go14/src/runtime/zruntime_defs_linux_.go'
pkg_create: can't stat `/home/username/pkg/usr/work/lang/go14/work/.destdir/home/username/pkg/go14/src/runtime/zsys_linux_.s'
pkg_create: lstat failed for file go14/pkg/linux_/internal/syscall.a: No such file or directory
/bin/mv: cannot stat '/home/username/pkg/usr/work/lang/go14/work/.packages/go14-1.4.3nb4.tmp.tgz': No such file or directory
*** Error code 1

Stop.
bmake[1]: stopped in /home/username/pkgsrc/lang/go14
*** Error code 1

Stop.
bmake: stopped in /home/username/pkgsrc/lang/go14

real	10m27.786s
user	10m46.180s
sys	0m54.170s





$ more ~/pkg/etc/mk.conf
# Example /home/username/pkg/etc/mk.conf file produced by bootstrap-pkgsrc
# Sun Apr 16 22:52:08 PDT 2017

.ifdef BSD_PKG_MK	# begin pkgsrc settings


UNPRIVILEGED=		yes
PKG_DBDIR=		/home/username/pkg/pkgdb
LOCALBASE=		/home/username/pkg
VARBASE=		/home/username/pkg/var
PKG_TOOLS_BIN=		/home/username/pkg/sbin
PKGINFODIR=		info
PKGMANDIR=		man

TOOLS_PLATFORM.awk?=		/home/username/pkg/bin/nawk
TOOLS_PLATFORM.sh?=		/bin/bash

WRKOBJDIR=${HOME}/pkg/usr/work
DISTDIR=${HOME}/pkg/usr/distfiles

PYTHON_VERSION_DEFAULT=36
#PYTHON_VERSION_REQD=36

.endif			# end pkgsrc settings





$ uname -a
Linux rpidesktop 4.4.41-v7+ #942 SMP Mon Jan 9 15:00:25 GMT 2017 armv7l armv7l armv7l GNU/Linux





$ more /etc/os-release 
NAME="Ubuntu"
VERSION="16.04.2 LTS (Xenial Xerus)"
ID=ubuntu
ID_LIKE=debian
PRETTY_NAME="Ubuntu 16.04.2 LTS"
VERSION_ID="16.04"
HOME_URL="http://www.ubuntu.com/"
SUPPORT_URL="http://help.ubuntu.com/"
BUG_REPORT_URL="http://bugs.launchpad.net/ubuntu/"
VERSION_CODENAME=xenial
UBUNTU_CODENAME=xenial



After suggestion from mamash (https://github.com/joyent/pkgsrc/issues/485#issuecomment-294908878):




$ bmake show-var VARNAME=MACHINE_ARCH
armv7l


$ git diff version.mk
diff --git a/lang/go/version.mk b/lang/go/version.mk
index f59fbe1..f63d3a7 100644
--- a/lang/go/version.mk
+++ b/lang/go/version.mk
@@ -13,7 +13,7 @@ GOCHAR=               8
    .elif ${MACHINE_ARCH} == "x86_64"
    GOARCH=                amd64
    GOCHAR=                6
-.elif !empty(MACHINE_ARCH:M*arm)
+.elif !empty(MACHINE_ARCH:M*arm*)
    GOARCH=                arm
    GOCHAR=                5
    .endif




$ time bmake deinstall reinstall
===> Deinstalling for go-1.8.1
=> Bootstrap dependency digest>=20010302: found digest-20160304
===> Checking for vulnerabilities in go-1.8.1
===> Building for go-1.8.1
cd /home/username/pkg/usr/work/lang/go/work/go/src/syscall &&  env GOOS=linux GOARCH=armv7l  /home/username/pkg/bin/perl mksyscall_solaris.pl  syscall_solaris.go syscall_solaris_amd64.go > zsyscall_solaris_amd64.go
cd /home/username/pkg/usr/work/lang/go/work/go/src && env GOROOT_BOOTSTRAP=/home/username/pkg/go14 GOROOT_FINAL=/home/username/pkg/go /bin/bash ./make.bash
##### Building Go bootstrap tool.
cmd/dist

##### Building Go toolchain using /home/username/pkg/go14.
bootstrap/cmd/internal/dwarf
bootstrap/cmd/internal/sys
bootstrap/cmd/asm/internal/flags
bootstrap/cmd/internal/bio
bootstrap/cmd/compile/internal/syntax
bootstrap/cmd/internal/gcprog
bootstrap/math/big
bootstrap/debug/pe
bootstrap/cmd/internal/obj
bootstrap/cmd/internal/obj/arm
bootstrap/cmd/internal/obj/arm64
bootstrap/cmd/internal/obj/mips
bootstrap/cmd/internal/obj/ppc64
bootstrap/cmd/internal/obj/s390x
bootstrap/cmd/internal/obj/x86
bootstrap/cmd/asm/internal/lex
bootstrap/cmd/link/internal/ld
bootstrap/cmd/asm/internal/arch
bootstrap/cmd/compile/internal/ssa
bootstrap/cmd/asm/internal/asm
bootstrap/cmd/asm
bootstrap/cmd/link/internal/amd64
bootstrap/cmd/link/internal/arm
bootstrap/cmd/link/internal/arm64
bootstrap/cmd/link/internal/mips
bootstrap/cmd/link/internal/mips64
bootstrap/cmd/link/internal/ppc64
bootstrap/cmd/link/internal/s390x
bootstrap/cmd/link/internal/x86
bootstrap/cmd/link
go build bootstrap/cmd/compile/internal/ssa: /home/username/pkg/go14/pkg/tool/linux_arm/5g: signal: killed
go tool dist: FAILED: /home/username/pkg/go14/bin/go install -gcflags=-l -tags=math_big_pure_go -v bootstrap/cmd/...: exit status 1
*** Error code 2

Stop.
bmake[1]: stopped in /home/username/pkgsrc/lang/go
*** Error code 1

Stop.
bmake: stopped in /home/username/pkgsrc/lang/go

real	1m16.153s
user	1m41.830s
sys	0m8.760s

>Fix:
N/A

>Release-Note:

>Audit-Trail:

Responsible-Changed-From-To: pkg-manager->bsiegert
Responsible-Changed-By: hauke@NetBSD.org
Responsible-Changed-When: Wed, 19 Apr 2017 17:34:09 +0000
Responsible-Changed-Why:
Over to maintainer.


From: "Maya Rashish" <maya@netbsd.org>
To: gnats-bugs@gnats.NetBSD.org
Cc: 
Subject: PR/52178 CVS commit: pkgsrc/lang/go
Date: Sun, 30 Apr 2017 23:02:09 +0000

 Module Name:	pkgsrc
 Committed By:	maya
 Date:		Sun Apr 30 23:02:09 UTC 2017

 Modified Files:
 	pkgsrc/lang/go: version.mk

 Log Message:
 go: match even more ARM with wildcards

 part 1 of PR pkg/52178 from aikchar


 To generate a diff of this commit:
 cvs rdiff -u -r1.24 -r1.25 pkgsrc/lang/go/version.mk

 Please note that diffs are not public domain; they are subject to the
 copyright notices on the relevant files.

From: coypu@sdf.org
To: gnats-bugs@NetBSD.org
Cc: 
Subject: Re: PR/52178 CVS commit: pkgsrc/lang/go
Date: Sun, 30 Apr 2017 23:45:11 +0000

 I seem to recall a similar issue, but can't find the issue either on our
 GNATS or the Golang github issue tracker. It mentioned a similar issue.

 I doubt I will be able to fix things, but the following may be useful to
 someone who can:

 - Mention your page size
 it seems this is possible to do with 'getconf PAGESIZE'

 - Mention which ARM ABI you are using
 I think file can do this, e.g. file `which gcc`.

 - Provide the output of the go14 testsuite

 It may be most informative if you run it as
 PATH=/home/username/pkg/go14/bin:${PATH} go test all

 (A good bunch of things are failing on my end too with working Go)

 The go1.4 bootstrap path isn't as tested, and your issue may be resolved
 in the latest go. it's possible to find the commit that fixed things via
 git bisect, but this is a time consuming and non trivial operation.

From: "Benny Siegert" <bsiegert@netbsd.org>
To: gnats-bugs@gnats.NetBSD.org
Cc: 
Subject: PR/52178 CVS commit: [pkgsrc-2017Q1] pkgsrc/lang/go
Date: Mon, 1 May 2017 09:55:46 +0000

 Module Name:	pkgsrc
 Committed By:	bsiegert
 Date:		Mon May  1 09:55:46 UTC 2017

 Modified Files:
 	pkgsrc/lang/go [pkgsrc-2017Q1]: version.mk

 Log Message:
 Pullup ticket #5392 - requested by sevan
 lang/go: build fix

 Revisions pulled up:
 - lang/go/version.mk                                            1.25

 ---
    Module Name:    pkgsrc
    Committed By:   maya
    Date:           Sun Apr 30 23:02:09 UTC 2017

    Modified Files:
            pkgsrc/lang/go: version.mk

    Log Message:
    go: match even more ARM with wildcards

    part 1 of PR pkg/52178 from aikchar


 To generate a diff of this commit:
 cvs rdiff -u -r1.23 -r1.23.2.1 pkgsrc/lang/go/version.mk

 Please note that diffs are not public domain; they are subject to the
 copyright notices on the relevant files.

State-Changed-From-To: open->feedback
State-Changed-By: bsiegert@NetBSD.org
State-Changed-When: Sat, 05 Aug 2017 09:50:07 +0000
State-Changed-Why:
Could you try again, please?


From: Hamza Sheikh <aikchar@codeghar.com>
To: gnats-bugs@netbsd.org
Cc: bsiegert@netbsd.org
Subject: Re: pkg/52178 (Building lang/go14 on Raspberry Pi 2 on Ubuntu 16.04
 fails with error '/bin/mv: cannot stat ...')
Date: Tue, 12 Sep 2017 15:54:57 -0700

 --f403045e1d90bb304f055905ee8e
 Content-Type: text/plain; charset="UTF-8"

 On Sat, Aug 5, 2017 at 2:50 AM, <bsiegert@netbsd.org> wrote:

 > Synopsis: Building lang/go14 on Raspberry Pi 2 on Ubuntu 16.04 fails with
 > error '/bin/mv: cannot stat ...'
 >
 > State-Changed-From-To: open->feedback
 > State-Changed-By: bsiegert@NetBSD.org
 > State-Changed-When: Sat, 05 Aug 2017 09:50:07 +0000
 > State-Changed-Why:
 > Could you try again, please?
 >
 >
 >
 >

 I tried installing Go on Ubuntu on rpi2 and x86_64 using trunk and
 pkgsrc_2017Q1 branches. All attempts failed. Log files are linked at the
 end. Excerpts of error messages:

 --- pkgsrc_2017Q1-branch-rpi2 ---

 go build bootstrap/cmd/compile/internal/ssa:
 /home/abbayi/pkg/go14/pkg/tool/linux_arm/5g: signal: killed
 go tool dist: FAILED: /home/abbayi/pkg/go14/bin/go install -gcflags=-l
 -tags=math_big_pure_go -v bootstrap/cmd/...: exit status 1
 *** Error code 2

 --- trunk-branch-rpi2 ---

 go build bootstrap/cmd/compile/internal/ssa:
 /home/abbayi/pkg/go14/pkg/tool/linux_arm/5g: signal: killed
 go tool dist: FAILED: /home/abbayi/pkg/go14/bin/go install -gcflags=-l
 -tags=math_big_pure_go -v bootstrap/cmd/...: exit status 1
 *** Error code 2

 --- trunk-branch-x86_64 ---

 # runtime/cgo
 /usr/bin/ld: -r and -pie may not be used together
 collect2: error: ld returned 1 exit status
 archive/zip
 compress/lzw
 compress/zlib
 database/sql/driver
 encoding/csv
 encoding/gob
 database/sql
 cmd/pprof/internal/commands
 cmd/pprof/internal/driver
 image/draw
 image/jpeg
 image/gif
 image/png
 runtime/debug
 testing
 testing/iotest
 testing/quick
 text/scanner
 *** Error code 2


 [0]
 http://mushtarka.codeghar.com/netbsd/2017/gnats/52178/pkgsrc_2017Q1-branch-rpi2.log
 [1]
 http://mushtarka.codeghar.com/netbsd/2017/gnats/52178/trunk-branch-rpi2.log
 [2]
 http://mushtarka.codeghar.com/netbsd/2017/gnats/52178/trunk-branch-x86_64.log

 --f403045e1d90bb304f055905ee8e
 Content-Type: text/html; charset="UTF-8"
 Content-Transfer-Encoding: quoted-printable

 <div dir=3D"ltr"><div class=3D"gmail_extra"><div class=3D"gmail_quote">On S=
 at, Aug 5, 2017 at 2:50 AM,  <span dir=3D"ltr">&lt;<a href=3D"mailto:bsiege=
 rt@netbsd.org" target=3D"_blank">bsiegert@netbsd.org</a>&gt;</span> wrote:<=
 br><blockquote class=3D"gmail_quote" style=3D"margin:0px 0px 0px 0.8ex;bord=
 er-left:1px solid rgb(204,204,204);padding-left:1ex"><span class=3D"gmail-"=
 >Synopsis: Building lang/go14 on Raspberry Pi 2 on Ubuntu 16.04 fails with =
 error &#39;/bin/mv: cannot stat ...&#39;<br>
 <br>
 </span>State-Changed-From-To: open-&gt;feedback<br>
 State-Changed-By: bsiegert@NetBSD.org<br>
 State-Changed-When: Sat, 05 Aug 2017 09:50:07 +0000<br>
 State-Changed-Why:<br>
 Could you try again, please?<br>
 <br>
 <br>
 <br>
 </blockquote></div><br></div><div class=3D"gmail_extra"><br></div><div clas=
 s=3D"gmail_extra">I tried installing Go on Ubuntu on rpi2 and x86_64 using =
 trunk and pkgsrc_2017Q1 branches. All attempts failed. Log files are linked=
  at the end. Excerpts of error messages:</div><div class=3D"gmail_extra"><b=
 r></div><div class=3D"gmail_extra">--- pkgsrc_2017Q1-branch-rpi2 ---</div><=
 div class=3D"gmail_extra"><br></div><div class=3D"gmail_extra"><div class=
 =3D"gmail_extra">go build bootstrap/cmd/compile/internal/ssa: /home/abbayi/=
 pkg/go14/pkg/tool/linux_arm/5g: signal: killed</div><div class=3D"gmail_ext=
 ra">go tool dist: FAILED: /home/abbayi/pkg/go14/bin/go install -gcflags=3D-=
 l -tags=3Dmath_big_pure_go -v bootstrap/cmd/...: exit status 1</div><div cl=
 ass=3D"gmail_extra">*** Error code 2</div></div><div class=3D"gmail_extra">=
 <br></div><div class=3D"gmail_extra">--- trunk-branch-rpi2 ---</div><div cl=
 ass=3D"gmail_extra"><br></div><div class=3D"gmail_extra"><div class=3D"gmai=
 l_extra">go build bootstrap/cmd/compile/internal/ssa: /home/abbayi/pkg/go14=
 /pkg/tool/linux_arm/5g: signal: killed</div><div class=3D"gmail_extra">go t=
 ool dist: FAILED: /home/abbayi/pkg/go14/bin/go install -gcflags=3D-l -tags=
 =3Dmath_big_pure_go -v bootstrap/cmd/...: exit status 1</div><div class=3D"=
 gmail_extra">*** Error code 2</div></div><div class=3D"gmail_extra"><br></d=
 iv><div class=3D"gmail_extra">--- trunk-branch-x86_64 ---</div><div class=
 =3D"gmail_extra"><br></div><div class=3D"gmail_extra"><div class=3D"gmail_e=
 xtra"># runtime/cgo</div><div class=3D"gmail_extra">/usr/bin/ld: -r and -pi=
 e may not be used together</div><div class=3D"gmail_extra">collect2: error:=
  ld returned 1 exit status</div><div class=3D"gmail_extra">archive/zip</div=
 ><div class=3D"gmail_extra">compress/lzw</div><div class=3D"gmail_extra">co=
 mpress/zlib</div><div class=3D"gmail_extra">database/sql/driver</div><div c=
 lass=3D"gmail_extra">encoding/csv</div><div class=3D"gmail_extra">encoding/=
 gob</div><div class=3D"gmail_extra">database/sql</div><div class=3D"gmail_e=
 xtra">cmd/pprof/internal/commands</div><div class=3D"gmail_extra">cmd/pprof=
 /internal/driver</div><div class=3D"gmail_extra">image/draw</div><div class=
 =3D"gmail_extra">image/jpeg</div><div class=3D"gmail_extra">image/gif</div>=
 <div class=3D"gmail_extra">image/png</div><div class=3D"gmail_extra">runtim=
 e/debug</div><div class=3D"gmail_extra">testing</div><div class=3D"gmail_ex=
 tra">testing/iotest</div><div class=3D"gmail_extra">testing/quick</div><div=
  class=3D"gmail_extra">text/scanner</div><div class=3D"gmail_extra">*** Err=
 or code 2</div></div><div class=3D"gmail_extra"><br></div><div class=3D"gma=
 il_extra"><br></div><div class=3D"gmail_extra">[0]=C2=A0<a href=3D"http://m=
 ushtarka.codeghar.com/netbsd/2017/gnats/52178/pkgsrc_2017Q1-branch-rpi2.log=
 ">http://mushtarka.codeghar.com/netbsd/2017/gnats/52178/pkgsrc_2017Q1-branc=
 h-rpi2.log</a></div><div class=3D"gmail_extra">[1]=C2=A0<a href=3D"http://m=
 ushtarka.codeghar.com/netbsd/2017/gnats/52178/trunk-branch-rpi2.log">http:/=
 /mushtarka.codeghar.com/netbsd/2017/gnats/52178/trunk-branch-rpi2.log</a></=
 div><div class=3D"gmail_extra">[2]=C2=A0<a href=3D"http://mushtarka.codegha=
 r.com/netbsd/2017/gnats/52178/trunk-branch-x86_64.log">http://mushtarka.cod=
 eghar.com/netbsd/2017/gnats/52178/trunk-branch-x86_64.log</a></div><div cla=
 ss=3D"gmail_extra"><br></div></div>

 --f403045e1d90bb304f055905ee8e--

From: Hamza Sheikh <hamza@codeghar.com>
To: gnats-bugs@netbsd.org
Cc: bsiegert@netbsd.org
Subject: Re: pkg/52178 (Building lang/go14 on Raspberry Pi 2 on Ubuntu 16.04
 fails with error '/bin/mv: cannot stat ...')
Date: Fri, 15 Sep 2017 21:15:45 -0700

 I made a mistake. I was using an unmaintained git repo[0]. I am now
 using the NetBSD git repo[1].

 Go 1.9 installed successfully on Ubuntu 17.10 dev release with pkgsrc
 trunk branch commit 02d62fbfb0.

 I'm in the process of trying Go 1.9 install on rpi2 with Ubuntu 16.04.
 It's slow going but when it's done I'll share results.

 My apologies for the HTML email before, too.

 [0] https://github.com/jsonn/pkgsrc.git
 [1] https://github.com/NetBSD/pkgsrc.git

From: Hamza Sheikh <aikchar@codeghar.com>
To: gnats-bugs@netbsd.org
Cc: bsiegert@netbsd.org
Subject: Re: pkg/52178 (Building lang/go14 on Raspberry Pi 2 on Ubuntu 16.04
 fails with error '/bin/mv: cannot stat ...')
Date: Sat, 16 Sep 2017 10:48:55 -0700

 Go 1.9 install failed on Ubuntu 16.04.3 with pkgsrc trunk branch[0]
 commit 02d62fbfb0. Full script(1) output[1] of `bmake install` is
 linked below.

 --- Snippet of script(1) output ---
 bootstrap/cmd/link
 go build bootstrap/cmd/compile/internal/ssa:
 /home/abbayi/pkg/go14/pkg/tool/linux_arm/5g: signal: killed
 go tool dist: FAILED: /home/abbayi/pkg/go14/bin/go install -gcflags=-l
 -tags=math_big_pure_go -v bootstrap/cmd/...: exit status 1
 *** Error code 2

 Stop.
 bmake[1]: stopped in /home/abbayi/pkgsrc/lang/go
 *** Error code 1

 Stop.
 bmake: stopped in /home/abbayi/pkgsrc/lang/go


 [0] https://github.com/NetBSD/pkgsrc.git
 [1] http://mushtarka.codeghar.com/netbsd/2017/gnats/52178/go-trunk-rpi2-20170915.log

>Unformatted:

NetBSD Home
NetBSD PR Database Search

(Contact us) $NetBSD: query-full-pr,v 1.39 2013/11/01 18:47:49 spz Exp $
$NetBSD: gnats_config.sh,v 1.8 2006/05/07 09:23:38 tsutsui Exp $
Copyright © 1994-2014 The NetBSD Foundation, Inc. ALL RIGHTS RESERVED.