NetBSD Problem Report #60040

From www@netbsd.org  Thu Feb 26 09:36:22 2026
Return-Path: <www@netbsd.org>
Received: from mail.netbsd.org (mail.netbsd.org [199.233.217.200])
	(using TLSv1.3 with cipher TLS_AES_256_GCM_SHA384 (256/256 bits)
	 key-exchange X25519 server-signature RSA-PSS (2048 bits) server-digest SHA256
	 client-signature RSA-PSS (2048 bits) client-digest SHA256)
	(Client CN "mail.netbsd.org", Issuer "R13" (verified OK))
	by mollari.NetBSD.org (Postfix) with ESMTPS id 1ACCD1A9239
	for <gnats-bugs@gnats.NetBSD.org>; Thu, 26 Feb 2026 09:36:22 +0000 (UTC)
Message-Id: <20260226093620.E54491A923C@mollari.NetBSD.org>
Date: Thu, 26 Feb 2026 09:36:20 +0000 (UTC)
From: nico@rintene.trade
Reply-To: nico@rintene.trade
To: gnats-bugs@NetBSD.org
Subject: zlib-ng-2.3.3 package fails to build
X-Send-Pr-Version: www-1.0
X-From4GNATS: "nico@rintene.trade via gnats" <gnats-admin@NetBSD.org>

>Number:         60040
>Category:       pkg
>Synopsis:       zlib-ng-2.3.3 package fails to build
>Confidential:   no
>Severity:       non-critical
>Priority:       low
>Responsible:    drixter
>State:          dead
>Class:          sw-bug
>Submitter-Id:   net
>Arrival-Date:   Thu Feb 26 09:40:00 +0000 2026
>Closed-Date:    Wed Oct 07 19:36:11 +0000 2026
>Last-Modified:  Wed Oct 07 19:36:11 +0000 2026
>Originator:     nico
>Release:        pkgsrc-2025Q4
>Organization:
rintene.trade
>Environment:
SunOS briareus 5.11 joyent_20251113T010957Z i86pc i386 i86pc
>Description:
Package fails at the linking stage: 
[ 75%] Linking C shared library libz-ng.so
ld: fatal: file /home/pbulk/build/archivers/zlib-ng/work/zlib-ng-2.3.3/cmake-pkgsrc-build/zlib-ng.map: unknown file type
ld: fatal: file processing errors. No output written to libz-ng.so.2.3.3
collect2: error: ld returned 1 exit status
--- libz-ng.so.2.3.3 ---
*** [libz-ng.so.2.3.3] Error code 1

bmake[2]: stopped making "CMakeFiles/zlib-ng.dir/build" in /home/pbulk/build/archivers/zlib-ng/work/zlib-ng-2.3.3/cmake-pkgsrc-build
bmake[2]: 1 error

bmake[2]: stopped making "CMakeFiles/zlib-ng.dir/build" in /home/pbulk/build/archivers/zlib-ng/work/zlib-ng-2.3.3/cmake-pkgsrc-build
--- CMakeFiles/zlib-ng-static.dir/all ---
*** [CMakeFiles/zlib-ng-static.dir/all] Error code 6
>How-To-Repeat:

>Fix:
patch-CMakeLists.txt

$NetBSD$

--- CMakeLists.txt.orig 2026-02-26 09:31:30.086903021 +0000
+++ CMakeLists.txt
@@ -1476,7 +1476,7 @@ if(NOT DEFINED BUILD_SHARED_LIBS OR BUIL
         if(HAVE_NO_INTERPOSITION)
             set_target_properties(zlib-ng PROPERTIES COMPILE_FLAGS "-fno-semantic-interposition")
         endif()
-        if(NOT APPLE AND NOT CMAKE_SYSTEM_NAME STREQUAL AIX)
+        if(NOT APPLE AND NOT CMAKE_SYSTEM_NAME STREQUAL AIX AND NOT CMAKE_SYSTEM_NAME STREQUAL SunOS)
             if(NOT ZLIB_COMPAT)
                 add_definitions(-DHAVE_SYMVER)
             endif()



>Release-Note:

>Audit-Trail:

Responsible-Changed-From-To: pkg-manager->drixter
Responsible-Changed-By: drixter@NetBSD.org
Responsible-Changed-When: Mon, 22 Jun 2026 20:16:06 +0000
Responsible-Changed-Why:
Trying to reproduce on 'SunOS omnios 5.11 omnios-r151058-516f7694c9 i86pc i386 i86pc'


State-Changed-From-To: open->feedback
State-Changed-By: drixter@NetBSD.org
State-Changed-When: Mon, 22 Jun 2026 20:16:06 +0000
State-Changed-Why:
I'm not unable to reproduce on my machine, package compile correctly, it is still valid for you?

root@omnios:/data/pkgsrc/archivers/zlib-ng# bmake clean
===> Cleaning for zlib-ng-2.3.3
root@omnios:/data/pkgsrc/archivers/zlib-ng# bmake
=> Bootstrap dependency digest>=20211023: found digest-20220214
=> Checksum BLAKE2s OK for zlib-ng-2.3.3.tar.gz
=> Checksum SHA512 OK for zlib-ng-2.3.3.tar.gz
===> Installing dependencies for zlib-ng-2.3.3
=> Tool dependency cmake>=0: found cmake-4.3.3
=> Tool dependency mktools-[0-9]*: found mktools-20220614
=> Tool dependency bsdtar-[0-9]*: found bsdtar-3.8.7
=> Tool dependency cwrappers>=20150314: found cwrappers-20220403
=> Build dependency gcc13>=13.4.0: found gcc13-13.4.0
=> Full dependency gcc13-libs>=13.1.0: found gcc13-libs-13.4.0
===> Checking for vulnerabilities in zlib-ng-2.3.3
===> Overriding tools for zlib-ng-2.3.3
===> Extracting for zlib-ng-2.3.3
===> Patching for zlib-ng-2.3.3
===> Creating toolchain wrappers for zlib-ng-2.3.3
===> Configuring for zlib-ng-2.3.3
=> Adding run-time search paths to pkg-config files.
-- Using CMake version 4.3.3
-- ZLIB_HEADER_VERSION: 1.3.1
-- ZLIBNG_HEADER_VERSION: 2.3.3
-- The C compiler identification is GNU 13.4.0
-- Detecting C compiler ABI info
-- Detecting C compiler ABI info - done
-- Check for working C compiler: /data/pkgsrc/archivers/zlib-ng/work/.cwrapper/bin/gcc - skipped
-- Detecting C compile features
-- Detecting C compile features - done
-- Arch detected: 'x86_64'
-- Basearch of 'x86_64' has been detected as: 'x86'
-- Performing Test FNO_LTO_AVAILABLE
-- Performing Test FNO_LTO_AVAILABLE - Success
-- Looking for arm_acle.h
-- Looking for arm_acle.h - not found
-- Looking for sys/auxv.h
-- Lookind
-- Looking for sys/sdt.h
-- Looking for sys/sdt.h - found
-- Looking for unistd.h
-- Looking for unistd.h - found
-- Looking for linux/auxvec.h
-- Looking for linux/auxvec.h - not found
-- Looking for sys/types.h
-- Looking for sys/types.h - found
-- Looking for stdint.h
-- Looking for stdint.h - found
-- Looking for stddef.h
-- Looking for stddef.h - found
-- Check size of off64_t
-- Check size of off64_t - done
-- Looking for fseeko
-- Looking for fseeko - found
-- Looking for strerror
-- Looking for strerror - found
-- Looking for __cpuid_count
-- Looking for __cpuid_count - found
-- Performing Test HAVE_CPUID_MS
-- Performing Test HAVE_CPUID_MS - Failed
-- Performing Test HAVE_NO_INTERPOSITION
-- Performing Test HAVE_NO_INTERPOSITION - Success
-- Performing Test HAVE_ATTRIBUTE_VISIBILITY_HIDDEN
-- Performing Test HAVE_ATTRIBUTE_VISIBILITY_HIDDEN - Success
-- Performing Test HAVE_ATTRIBUTE_VISIBILITY_INTERNAL
-- Performing Test HAVE_ATTRIBUTE_VISIBILITY_INTERNAL - Success
-- Performing Test HAVE_ATTRIBUTE_ALIGNED
-- Performing Test HAVE_ATTRIBUTE_ALIGNED - Success
-- Performing Test HAVE_BUILTIN_ASSUME_ALIGNED
-- Performing Test HAVE_BUILTIN_ASSUME_ALIGNED - Success
-- Performing Test HAVE_BUILTIN_CTZ
-- Performing Test HAVE_BUILTIN_CTZ - Success
-UILTIN_CTZLL
-- Performing Test cess
-- Performing Test HAVE_PTRDIFF_T
-- Performing Test HAVE_PTRDIFF_T - Success
-- Performing Test HAVE_XSAVE_INTRIN
-- Performing Test HAVE_XSAVE_INTRIN - Success
-- Performing Test HAVE_SSE2_INTRIN
-- Performing Test HAVE_SSE2_INTRIN - Success
-- Performing Test HAVE_SSSE3_INTRIN
-- Performing Test HAVE_SSSE3_INTRIN - Success
-- Performing Test HAVE_SSE41_INTRIN
-- Performing Test HAVE_SSE41_INTRIN - Success
-- Performing Test HAVE_SSE42_INTRIN
-- Performing Test HAVE_SSE42_INTRIN - Success
-- Performing Test HAVE_PCLMULQDQ_INTRIN
-- Performing Test HAVE_PCLMULQDQ_INTRIN - Success
-- Performing Test HAVE_AVX2_INTRIN
-- Performing Test HAVE_AVX2_INTRIN - Success
-- Performing Test HAVE_CASCADE_LAKE
-- Performing Test HAVE_CASCADE_LAKE - Success
-- Performing Test HAVE_AVX512_INTRIN
-- Performing Test HAVE_AVX512_INTRIN - Success
-- Performing Test HAVE_AVX512VNNI_INTRIN
-- Performing Test HAVE_AVX512VNNI_INTRIN - Success
-- Performing Test HAVE_VPCLMULQDQ_INTRIN
-- Performing Test HAVE_VPCLMULQDQ_INTRIN - Success
-- Architecture-specific source files: arch/x86/x86_features.c;arch/x86/chunkset_sse2.c;arch/x86/chorba_sse2.c;arch/x86/compare256_sse2.c;arch/x86/slide_hash_sse2.c;arch/x86/adler32_ssse3.c;arch/x86/chunkset_ssse3.c;arch/x86/chorba_sse41.c;arch/x86/adler32_sse42.c;arch/x86/crc32_pclmulqdq.c;arch/x86/slide_hash_avx2.c;arch/x86/chunkset_avx2.c;arch/x86/compare256_avx2.c;arch/x86/adler32_avx2.c;arch/x86/adler32_avx512.c;arch/x86/chunkset_avx512.c;arch/x86/compare256_avx512.c;arch/x86/adler32_avx512_vnni.c;arch/x86/crc32_vpclmulqdq.c
-- The following features have been enabled:

 * CMAKE_BUILD_TYPE, Build type: Release (default)
 * XSAVE, Support XSAVE intrinsics using "-mxsave"
 * SSSE3_ADLER32, Support SSSE3-accelerated adler32, using "-mssse3"
 * SSE42_CRC, Support SSE4.2 optimized adler32 hash generation, using "-msse4.2"
 * PCLMUL_CRC, Support CRC hash generation using PCLMULQDQ, using "-msse4.2 -mpclmul"
 * AVX2_SLIDEHASH, Support AVX2 optimized slide_hash, using "-mavx2 -mbmi2"
 * AVX2_CHUNKSET, Support AVX2 optimized chunkset, using "-mavx2 -mbmi2"
 * AVX2_COMPARE256, Support AVX2 optimized compare256, using "-mavx2 -mbmi2"
 * AVX2_ADLER32, Support AVX2-accelerated adler32, using "-mavx2 -mbmi2"
 * AVX512_ADLER32, Support AVX512-accelerated adler32, using "-mavx512f -mavx512dq -mavx512bw -mavx512vl -mbmi2 -mtune=cascadelake"
 * AVX512_CHUNKSET, Support AVX512 optimized chunkset, using "-mavx512f -mavx512dq -mavx512bw -mavx512vl -mbmi2 -mtune=cascadelake"
 * AVX512_COMPARE256, Support AVX512 optimized compare256, using "-mavx512f -mavx512dq -mavx512bw -mavx512vl -mbmi2 -mtune=cascadelake"
 * AVX512VNNI_ADLER32, Support AVX512VNNI adler32, using "-mavx512f -mavx512dq -mavx512bw -mavx512vl -mavx512vnni -mbmi2 -mtune=cascadelake"
 * VPCLSupport CRC hash generation using VPCLMULQDQ, using "-mpclmul -mvpclmulqdq -mavx512f -mavx512f -mavx512dq -mavx512bw -mavx512vl -mbmi2 -mtune=cascadelake"
 * WITH_GZFILEOP, Compile with support for gzFile related functions
 * ZLIB_ALIASES, Compile with zlib compatible CMake targets
 * BUILD_TESTING, Build test binaries
 * WITH_SANITIZER, Enable sanitizer testing support
 * WITH_OPTIM, Build with optimisation
 * WITH_NEW_STRATEGIES, Use new strategies
 * WITH_CRC32_CHORBA, Use optimized CRC32 algorithm Chorba
 * WITH_RUNTIME_CPU_DETECTION, Build with runtime CPU detection
 * WITH_SSE2, Build with SSE2
 * WITH_SSSE3, Build with SSSE3
 * WITH_SSE41, Build with SSE41
 * WITH_SSE42, Build with SSE42
 * WITH_PCLMULQDQ, Build with PCLMULQDQ
 * WITH_AVX2, Build with AVX2
 * WITH_AVX512, Build with AVX512
 * WITH_AVX512VNNI, Build with AVX512 VNNI
 * WITH_VPCLMULQDQ, Build with VPCLMULQDQ

-- The following features have been disabled:

 * ZLIB_SYMBOL_PREFIX, Publicly exported symbols DO NOT have a custom prefix
 * ZLIB_COMPAT, Compile with zlib compatible API
 * WITH_GTEST, Build tests using Gtest framework
 * WITH_FUZZERS, Build test/fuzz
 * WITH_BENCHMARKS, Build benchmarks using Google Benchmark framework
 * WITH_BENCHMARK_APPS, Build application benchmarks (currently libpng)
 * WITH_ALL_FALLBACKS, Build all generic fallback functions
 * WITH_NATIVE_INSTRUCTIONS, Instruct the compiler to use the full instruction set on this host (gcc/clang -march=native)
 * WITH_MAINTAINER_WARNINGS, Build with project maintainer warnings
 * WITH_CODE_COVERAGE, Enable code coverage reporting
 * WITH_INFLATE_STRICT, Build with strict inflate distance checking
 * WITH_INFLATE_ALLOW_INVALID_DIST, Build with zero fill for inflate invalid distances
 * INSTALL_UTILS, Copy minigzip and minideflate during install

-- Configuring done (6.6s)
-- Generating done (0.0s)
CMake Warning:
  Manually-specified variables were not used by the project:

    FETCHCONTENT_FULLY_DISCONNECTED


-- Build files have been written to: /data/pkg/zlib-ng/work/zlib-ng-2.3.3/cmake-pkgsrc-build
===> Building for zlib-ng-2.3.3
[  1%] Building C object CMakeFiles/zlib-ng.dir/arch/generic/adler32_c.c.o
[  2%] Building C object CMakeFiles/zlib-ng.dir/arch/generic/adler32_fold_c.c.o
[  3%] Building C object CMakeFiles/zli/generic/crc32_braid_c.c.o
[  4%] Building C object CMakeFiles/zlib-ng.dir/arch/generic/crc32_fold_c.c.o
[  4%] Building C object CMakeFiles/zlib-ng.dir/adler32.c.o
[  5%] Building C object CMakeFiles/zlib-ng.dir/compress.c.o
[  6%] Building C object CMakeFiles/zlib-ng.dir/crc32.c.o
[  7%] Building C object CMakeFiles/zlib-ng.dir/crc32_braid_comb.c.o
[  8%] Building C object CMakeFiles/zlib-ng.dir/deflate.c.o
[  9%] Building C object CMakeFiles/zlib-ng.dir/deflate_fast.c.o
[  9%] Building C object CMakeFiles/zlib-ng.dir/deflate_huff.c.o
[ 10%] Building C object CMakeFiles/zlib-ng.dir/deflate_medium.c.o
[ 11%] Building C object CMakeFiles/zlib-ng.dir/deflate_quick.c.o
[ 12%] Building C object CMakeFiles/zlib-ng.dir/deflate_rle.c.o
[ 13%] Building C object CMakeFiles/zlib-ng.dir/deflate_slow.c.o
[ 14%] Building C object CMakeFiles/zlib-ng.dir/deflate_stored.c.o
[ 14%] Building C object CMakeFiles/zlib-ng.dir/functable.c.o
[ 15%] Building C object CMakeFiles/zlib-ng.dir/infback.c.o
[ 16%] Building C object CMakeFiles/zlib-ng.dir/inflate.c.o
[ 17%] Building C object CMakeFiles/zlib-ng.dir/inftrees.c.o
[ 18%] Building C object CMakeFiles/zlib-ng.dir/insert_string.c.o
[ 19%] Building C object CMakeFiles/zlib-ng.dir/insert_string_roll.c.o
[ 19%] Building C object CMakeFiles/zlib-ng.dir/trees.c.o
[ 20%] Building C object CMakeFiles/zlib-ng.dir/uncompr.c.o
[ 21%] Building C object CMakeFiles/zlib-ng.dir/zutil.c.o
[ 22%] Building C object CMakeFiles/zlib-ng.dir/arch/generic/crc32_chorba_c.c.o
[ 23%] Building C object CMakeFiles/zlib-ng.dir/cpu_features.c.o
[ 24%] Building C object CMakeFiles/zlib-ng.dir/arch/x86/x86_features.c.o
[ 24%] Building C object CMakeFiles/zlib-ng.dir/arch/x86/chunkset_sse2.c.o
[ 25%] Building C object CMakeFilng.dir/arch/x86/chorba_sse2.c.o
[ 26%] Building C object CMakeFiles/zlib-ng.dir/arch/x86/compare256_sse2.c.o
[ 27%] Building C object CMakeFiles/zlib-ng.dir/arch/x86/slide_hash_sse2.c.o
[ 28%] Building C object CMakeFiles/zlib-ng.dir/arch/x86/adler32_ssse3.c.o
[ 29%] Building C object CMakeFiles/zlib-ng.dir/arch/x86/chunkset_ssse3.c.o
[ 29%] Building C object CMakeFiles/zlib-ng.dir/arch/x86/chorba_sse41.c.o
[ 30%] Building C object CMakeFiles/zlib-ng.dir/arch/x86/adler32_sse42.c.o
[ 31%] Building C object CMakeFiles/zlib-ng.dir/arch/x86/crc32_pclmulqdq.c.o
[ 32%] Building C object CMakeFiles/zlib-ng.dir/arch/x86/slide_hash_avx2.c.o
[ 33%] Building C object CMakeFiles/zlib-ng.dir/arch/x86/chunkset_avx2.c.o
[ 34%] Building C object CMakeFiles/zlib-ng.dir/arch/x86/compare256_avx2.c.o
[ 34%] Building C object CMakeFiles/zlib-ng.dir/arch/x86/adler32_avx2.c.o
[ 35%] Building C object CMakeFiles/zlib-ng.dir/arch/x86/adler32_avx512.c.o
[ 36%] Building C object CMakeFiles/zlib-ng.dir/arch/x86/chunkset_avx512.c.o
[ 37%] Building C object CMakeFiles/zlib-ng.dir/arch/x86/compare256_avx512.c.o
[ 38%] Building C object CMakeFiles/zlib-ng.dir/arch/x86/adler32_avx512_vnni.c.o
[ 39%] Building C object CMakeFiles/zlib-ng.dir/arch/x86/crc32_vpclmulqdq.c.o
[ 39%] Building C object CMakeFiles/zlib-ng.dir/gzlib.c.o
[ 40%] Building C object CMakeFiles/zlib-ng.dir/gzread.c.o
[ 41%] Building C object CMakeFiles/zlib-ng.dir/gzwrite.c.o
[ 42%] Linking C shared library libz-ng.so
[ 42%] Built target zlib-ng
[ 43%] Building C object CMakeFiles/zlib-ng-static.dir/arch/generic/adler32_c.c.o
[ 44%] Building C object CMakeFiles/zlib-ng-static.dir/arch/generic/adler32_fold_c.c.o
[ 44%] Building C object CMakeFiles/zlib-ng-static.dir/arch/generic/crc32_braid_c.c.o
[ 45%] Building C object CMakeFiles/zlib-ng-static.dir/arch/generic/crc32_fold_c.c.o
[ 46%] Building C object CMakeFiles/zlib-ng-static.dir/adler32.c.o
[ 47%] Building C object CMakeFiles/zlib-ng-static.dir/compress.c.o
[ 48%] Building C object CMakeFiles/zlib-ng-static.dir/crc32.c.o
[ 49%] Building C object CMakeFiles/zlib-ng-static.dir/crc32_braid_comb.c.o
[ 49%] Building C object CMakeFiles/zlib-ng-static.dir/deflate.c.o
[ 50%] Building C object CMakeFiles/zlib-ng-static.dir/deflate_fast.c.o
[ 51%] Building C object CMakeFiles/zlib-ng-static.dir/deflate_huff.c.o
[ Building C object CMakeFiles/zlib-ng-static.dir/deflate_medium.c.o
[ 53%] Building C object CMakeFiles/zlib-ng-static.dir/deflate_quick.c.o
[ 54%] Building C object CMakeFiles/zlib-ng-static.dir/deflate_rle.c.o
[ 54%] Building C object CMakeFiles/zlib-ng-static.dir/deflate_slow.c.o
[ 55%] Building C object CMakeFiles/zlib-ng-static.dir/deflate_stored.c.o
[ 56%] Building C object CMakeFiles/zlib-ng-static.dir/functable.c.o
[ 57%] Building C object CMakeFiles/zlib-ng-static.dir/infback.c.o
[ 58%] Building C object CMakeFiles/zlib-ng-static.dir/inflate.c.o
[ 59%] Building C object CMakeFiles/zlib-ng-static.dir/inftrees.c.o
[ 59%] Building C object CMakeFiles/zlib-ng-static.dir/insert_string.c.o
[ 60%] Building C object keFiles/zlib-ng-static.dir/insert_string_roll.c.o
[ 61%] Building C object CMakeFiles/zlib-ng-static.dir/trees.c.o
[ 62%] Building C object CMakeFiles/zlib-ng-static.dir/uncompr.c.o
[ 63%] Building C object CMakeFiles/zlib-ng-static.dir/zutil.c.o
[ 64%] Building C object CMakeFiles/zlib-ng-static.dir/arch/generic/crc32_chorba_c.c.o
[ 64%] Building C object CMakeFiles/zlib-ng-static.dir/cpu_features.c.o
[ 65%] Building C object CMakeFiles/zlib-ng-static.dir/arch/x86/x86_features.c.o
[ 66%] Building C object CMakeFiles/zlib-ng-static.dir/arch/x86/chunkset_sse2.c.o
[ 67%] Building C object CMakeFiles/zlib-ng-static.dir/arch/x86/chorba_sse2.c.o
[ 68%] Building C object CMakeFiles/zlib-ng-static.dir/arch/x86/compare256_sse2.c.o
[ 69%] Building C object CMakeFiles/zlib-ng-static.dir/arch/x86/slide_hash_sse2.c.o
[ 69%] Building C object CMakeFiles/zlib-ng-static.dir/arch/x86/adler32_ssse3.c.o
[ 70%] Building C object CMakeFiles/zlib-ng-static.dir/arch/x86/chunkset_ssse3.c.o
[ 71%] Building C object CMakeFiles/zlib-ng-static.dir/arch/x86/chorba_sse41.c.o
[ 72%] Building C object CMakeFiles/zlib-ng-static.dir/arch/x86/adler32_sse42.c.o
[ 73%] Building C object CMakeFiles/zlib-ng-static.dir/arch/x86/crc32_pclmulqdq.c.o
[ 74%] Building C object CMakeFiles/zlib-ng-static.dir/arch/x86/slide_hash_avx2.c.o
[ 74%] Building C object CMakeFiles/zlib-ng-static.dir/arch/x86/chunkset_avx2.c.o
[ 75%] Building C object CMakeFiles/zlib-ng-static.dir/arch/x86/compare256_avx2.c.o
[ 76%] Building C object CMakeFiles/zlib-ng-static.dir/arch/x86/adler32_avx2.c.o
[ 77%] Building C object CMakeFiles/zlib-ng-static.dir/arch/x86/adler32_avx512.c.o
[ 78%] Building C object CMakeFiles/zlib-ng-static.dir/arch/x86/chunkset_avx512.c.o
[ 79%] Building C object CMakeFiles/zlib-ng-static.dir/arch/x86/compare256_avx512.c.o
[ 79%] Building C object CMakeFiles/zlib-ng-static.dir/arch/x86/adler32_avx512_vnni.c.o
[ 80%] Building C object CMakeFiles/zlib-ng-static.dir/arch/x86/crc32_vpclmulqdq.c.o
[ 81%] Building C object CMakeFiles/zlib-ng-static.dir/gzlib.c.o
[ 82%] Building C object CMakeFiles/zlib-ng-static.dir/gzread.c.o
[ 83%] Building C object CMakeFiles/zlib-ng-static.dir/gzwrite.c.o
[ 84%] Linking C static library libz-ng.a
[ 84%] Built target zlib-ng-static
[ 84%] Building C object test/CMakeFiles/example.dir/example.c.o
[ 85%] Linking C executable ../example
[ 85%] Built target example
[ 86%] Building C object test/CMakeFiles/minigzip.dir/minigzip.c.o
[ 87%] Linking C executable ../minigzip
[ 87%] Built target minigzip
[ 88%] Building C object test/CMakeFiles/minideflate.dir/minideflate.c.o
[ 89%] Linking C executable ../minideflate
[ 89%] Built target minideflate
[ 89%] Building C object test/CMakeFiles/switchlevels.dir/switchlevels.c.o
[ 90%] Linking C executable ../switchlevels
[ 90%] Built target switchlevels
[ 91%] Building C object test/CMakeFiles/infcover.dir/infcover.c.o
[ 92%] Building C object test/CMakeFiles/infcover.dir/__/inftrees.c.o
[ 93%] Linking C executable ../infcover
[ 93%] Built target infcover
[ 94%] Building C object test/CMakeFiles/makefixed.dir/__/tools/makefixed.c.o
[ 95%] Building C object test/CMakeFiles/makefixed.dir/__/inftrees.c.o
[ 96%] Linking C executable ../makefixed
[ 96%] Built target makefixed
[ 97%] Building C object test/CMakeFiles/maketrees.dir/__/tools/maketrees.c.o
[ 98%] Building C object test/CMakeFiles/maketrees.dir/__/trees.c.o
[ 98%] Building C object test/CMakeFiles/maketrees.dir/__/zutil.c.o
[ 99%] Linking C executable ../maketrees
[ 99%] Built target maketrees
[100%] Building C object test/CMakeFiles/makecrct.dir/__/tools/makecrct.c.o
[100%] Linking C executable ../makecrct
[100%] Built target makecrct
root@omnios:/data/pkgsrc/archivers/zlib-ng# bmake package
=> Bootstrap dependency digest>=20211023: found digest-20220214
===> Checking for vulnerabilities in zlib-ng-2.3.3
===> Installing for zlib-ng-2.3.3
=> Generating pre-install file lists
[ 42%] Built target zlib-ng
[ 84%] Built target zlib-ng-static
[ 85%] Built target example
[ 87%] Built target minigzip
[ 89%] Built target minideflate
[ 90%] Built target switchlevels
[ 93%] Built target infcover
[ 96%] Built target makefixed
[ 99%] Built target maketrees
[100%] Built target makecrct
Installing the project stripped...
-- Install configuration: "Release"
-- Installing: /data/pkgsrc/archivers/zlib-ng/work/.destdir/opt/local/lib/libz-ng.so.2.3.3
-- Installing: /data/pkgsrc/archivers/zlib-ng/work/.destdir/opt/local/lib/libz-ng.so.2
-- Installing: /data/pkgsrc/archivers/zlib-ng/work/.destdir/opt/local/lib/libz-ng.so
-- Installing: /data/pkgsrc/archivers/zlib-ng/work/.destdir/opt/local/lib/libz-ng.a
-- Installing: /data/pkgsrc/archivers/zlib-ng/work/.destdir/opt/local/include/zlib-ng.h
-- Installing: /data/pkgsrc/archivers/zlib-ng/work/.destdir/opt/local/include/zlib_name_mangling-ng.h
-- Installing: /data/pkgsrc/archivers/zlib-ng/work/.destdir/opt/local/include/zconf-ng.h
-- Installing: /data/pkgsrc/archivers/zlib-ng/work/.destdir/opt/local/lib/pkgconfig/zlib-ng.pc
-- Installing: /data/pkgsrc/archivers/zlib-ng/work/.destdir/opt/local/lib/cmake/zlib-ng/zlib-ng-targets.cmake
-- Installing: /data/pkgsrc/archivers/zlib-ng/work/.destdir/opt/local/lib/cmake/zlib-ng/zlib-ng-targets-release.cmake
-- Installing: /data/pkgsrc/archivers/zlib-ng/work/.destdir/opt/local/lib/cmake/zlib-ng/zlib-ng-config.cmake
-- Installing: /data/pkgsrc/archivers/zlib-ng/work/.destdir/opt/local/lib/cmake/zlib-ng/zlib-ng-config-version.cmake
=> Automatic manual page handling
=> Generating post-install file lists
=> Checking file-check results for zlib-ng-2.3.3
=> Creating binary package /data/pkgsrc/archivers/zlib-ng/work/.packages/zlib-ng-2.3.3.tgz
===> Building binary package for zlib-ng-2.3.3
=> Creating binary package /data/pkgsrc/packages/All/zlib-ng-2.3.3.tgz
root@omnios:/data/pkgsrc/archivers/zlib-ng# uname -a
SunOS omnios 5.11 omnios-r151058-516f7694c9 i86pc i386 i86pc



State-Changed-From-To: feedback->dead
State-Changed-By: drixter@NetBSD.org
State-Changed-When: Wed, 07 Oct 2026 19:36:11 +0000
State-Changed-Why:
No response, probably not valid anymore


>Unformatted:

NetBSD Home
NetBSD PR Database Search

(Contact us) $NetBSD: query-full-pr,v 1.51 2026/08/10 02:28:17 riastradh Exp $
$NetBSD: gnats_config.sh,v 1.10 2026/05/13 22:00:09 riastradh Exp $
Copyright © 1994-2026 The NetBSD Foundation, Inc. ALL RIGHTS RESERVED.