NetBSD Problem Report #60409

From www@netbsd.org  Sat Jul  4 21:07:54 2026
Return-Path: <www@netbsd.org>
Received: from mail.netbsd.org (mail.netbsd.org [199.233.217.200])
	(using TLSv1.3 with cipher TLS_AES_256_GCM_SHA384 (256/256 bits)
	 key-exchange X25519 server-signature RSA-PSS (2048 bits)
	 client-signature RSA-PSS (2048 bits))
	(Client CN "mail.netbsd.org", Issuer "YR2" (not verified))
	by mollari.NetBSD.org (Postfix) with ESMTPS id AB0BD1A923F
	for <gnats-bugs@gnats.NetBSD.org>; Sat,  4 Jul 2026 21:07:54 +0000 (UTC)
Message-Id: <20260704210753.47F9B1A9243@mollari.NetBSD.org>
Date: Sat,  4 Jul 2026 21:07:53 +0000 (UTC)
From: campbell+netbsd@mumble.net
Reply-To: campbell+netbsd@mumble.net
To: gnats-bugs@NetBSD.org
Subject: x11/qt5-qtwebengine fails to build without dbus
X-Send-Pr-Version: www-1.0
X-From4GNATS: "campbell+netbsd@mumble.net via gnats" <gnats-admin@NetBSD.org>

>Number:         60409
>Category:       pkg
>Synopsis:       x11/qt5-qtwebengine fails to build without dbus
>Confidential:   no
>Severity:       serious
>Priority:       medium
>Responsible:    pkg-manager
>State:          open
>Class:          sw-bug
>Submitter-Id:   net
>Arrival-Date:   Sat Jul 04 21:10:00 +0000 2026
>Originator:     Taylor R Campbell
>Release:        netbsd-11, pkgsrc-2026Q2
>Organization:
The DbusFreeD Foundation
>Environment:
NetBSD manticore.local 11.0 NetBSD 11.0 (LIBKVER) #0: Tue Jan 19 00:00:00 UTC 2038 root@localhost:/sys/arch/amd64/compile/LIBKVER amd64

(really: NetBSD 11.0_RC5 kernel and userland)

BUILD_START_DIR=20260701.1613
>Description:
ERROR at //build/config/linux/pkg_config.gni:103:17: Script returned non-zero exit code.
    pkgresult = exec_script(pkg_config_script, args, "value")
                ^----------
Current dir: /tmp/pkgbuild/x11/qt5-qtwebengine/work/qtwebengine-everywhere-src-5.15.19/src/core/release/
Command: python /tmp/pkgbuild/x11/qt5-qtwebengine/work/qtwebengine-everywhere-src-5.15.19/src/3rdparty/chromium/build/config/linux/pkg-config.py -p pkg-config dbus-1
Returned 1.
stderr:

Package dbus-1 was not found in the pkg-config search path.
Perhaps you should add the directory containing `dbus-1.pc'
to the PKG_CONFIG_PATH environment variable
Package 'dbus-1' not found
Could not run pkg-config.

See //build/config/linux/dbus/BUILD.gn:12:1: whence it was called.
pkg_config("dbus") {
^-------------------
See //dbus/BUILD.gn:46:22: which caused the file to be included.
  public_configs = [ "//build/config/linux/dbus" ]
                     ^--------------------------
Project ERROR: GN run error!
gmake[2]: *** [Makefile:82: sub-gn_run-pro-make_first] Error 3
gmake[2]: Leaving directory '/tmp/pkgbuild/x11/qt5-qtwebengine/work/qtwebengine-everywhere-src-5.15.19/src/core'
gmake[1]: *** [Makefile:80: sub-core-make_first] Error 2
gmake[1]: Leaving directory '/tmp/pkgbuild/x11/qt5-qtwebengine/work/qtwebengine-everywhere-src-5.15.19/src'
gmake: *** [Makefile:49: sub-src-make_first] Error 2
*** Error code 2

Stop.
bmake[1]: stopped making "all" in /pkgsrc/x11/qt5-qtwebengine
*** Error code 1

Stop.
bmake: stopped making "all" in /pkgsrc/x11/qt5-qtwebengine

>How-To-Repeat:
cd x11/qt5-qtwebengine && bmake package
>Fix:
Yes, please!

NetBSD Home
NetBSD PR Database Search

(Contact us) $NetBSD: query-full-pr,v 1.51 2026/08/10 02:28:17 riastradh Exp $
$NetBSD: gnats_config.sh,v 1.10 2026/05/13 22:00:09 riastradh Exp $
Copyright © 1994-2026 The NetBSD Foundation, Inc. ALL RIGHTS RESERVED.