NetBSD Problem Report #60446
From www@netbsd.org Mon Jul 13 19:48:28 2026
Return-Path: <www@netbsd.org>
Received: from mail.netbsd.org (mail.netbsd.org [199.233.217.200])
(using TLSv1.3 with cipher TLS_AES_256_GCM_SHA384 (256/256 bits)
key-exchange X25519 server-signature RSA-PSS (2048 bits) server-digest SHA256
client-signature RSA-PSS (2048 bits) client-digest SHA256)
(Client CN "mail.netbsd.org", Issuer "YR2" (not verified))
by mollari.NetBSD.org (Postfix) with ESMTPS id 89B871A923E
for <gnats-bugs@gnats.NetBSD.org>; Mon, 13 Jul 2026 19:48:28 +0000 (UTC)
Message-Id: <20260713194826.F40BE1A923F@mollari.NetBSD.org>
Date: Mon, 13 Jul 2026 19:48:26 +0000 (UTC)
From: gavrilovegor519@gmail.com
Reply-To: gavrilovegor519@gmail.com
To: gnats-bugs@NetBSD.org
Subject: nano is not built in Xinuos UnixWare 7 Defenitive 2018
X-Send-Pr-Version: www-1.0
X-From4GNATS: "gavrilovegor519@gmail.com via gnats" <gnats-admin@NetBSD.org>
>Number: 60446
>Category: pkg
>Synopsis: nano is not built in Xinuos UnixWare 7 Defenitive 2018
>Confidential: no
>Severity: critical
>Priority: high
>Responsible: pkg-manager
>State: open
>Class: sw-bug
>Submitter-Id: net
>Arrival-Date: Mon Jul 13 19:50:00 +0000 2026
>Originator: Egor Gavrilov
>Release: Q1-2026
>Organization:
>Environment:
UnixWare uw7 5 7.1.4 i386 x86at SCO UNIX_SVR5
>Description:
gcc -DHAVE_CONFIG_H -I. -I.. -DLOCALEDIR=\"/opt/pkgsrc/pkgbin/lib/locale\" -DSYSCONFDIR=\"/opt/pkgsrc/pkgbin/etc\" -I../lib -I../lib -DNCURSES_WIDECHAR -I/opt/pkgsrc/pkgbin/include/ncurses -I/opt/pkgsrc/pkgbin/include -DUNIXWARE -I/opt/pkgsrc/pkgbin/include -DNCURSES_WIDECHAR=1 -I/opt/pkgsrc/pkgbin/include/ncurses -DUNIXWARE -O2 -I/opt/pkgsrc/pkgbin/include -DNCURSES_WIDECHAR=1 -I/opt/pkgsrc/pkgbin/include/ncurses -Wall -MT text.o -MD -MP -MF .deps/text.Tpo -c -o text.o text.c
text.c: In function 'treat':
text.c:2137:42: error: 'union <anonymous>' has no member named 'tv_sec'; did you mean 'st__sec'?
timestamp_sec = (long)fileinfo.st_mtim.tv_sec;
^~~~~~
st__sec
text.c:2138:43: error: 'union <anonymous>' has no member named 'tv_nsec'; did you mean 'st__sec'?
timestamp_nsec = (long)fileinfo.st_mtim.tv_nsec;
^~~~~~~
st__sec
text.c:2192:29: error: 'union <anonymous>' has no member named 'tv_sec'; did you mean 'st__sec'?
(long)fileinfo.st_mtim.tv_sec == timestamp_sec &&
^~~~~~
st__sec
text.c:2193:29: error: 'union <anonymous>' has no member named 'tv_nsec'; did you mean 'st__sec'?
(long)fileinfo.st_mtim.tv_nsec == timestamp_nsec) {
^~~~~~~
st__sec
gmake[2]: *** [Makefile:2359: text.o] Error 1
gmake[2]: Leaving directory '/opt/pkgsrc/pkgsrc/editors/nano/work/nano-8.7.1/src'
gmake[1]: *** [Makefile:2318: all-recursive] Error 1
gmake[1]: Leaving directory '/opt/pkgsrc/pkgsrc/editors/nano/work/nano-8.7.1'
gmake: *** [Makefile:2259: all] Error 2
*** Error code 2
Stop.
bmake[1]: stopped making "install" in /opt/pkgsrc/pkgsrc/editors/nano
*** Error code 1
Stop.
>How-To-Repeat:
Build nano with prefer-native=yes
>Fix:
(Contact us)
$NetBSD: query-full-pr,v 1.51 2026/08/10 02:28:17 riastradh Exp $
$NetBSD: gnats_config.sh,v 1.10 2026/05/13 22:00:09 riastradh Exp $
Copyright © 1994-2026
The NetBSD Foundation, Inc. ALL RIGHTS RESERVED.